program: Orca
programVersion: 5.0.3
elementType: C H C H C C C H H C H H C C H H H H H H H
charge: 1
multiplicity: 1
keywords: DSD-PBEP86 def2-TZVP RIJCOSX verytightscf def2-TZVP/C def2/J soscf noTRAH
formula: C8H13
InChI: InChI=1/C8H13/c1-2-4-6-8-7-5-3-1/h1-2,7H,3-6,8H2
21 atoms
C  -1.997427 0.530175 0.119988
H  -2.175172 0.722971 1.181514
C  -1.954241 -0.996803 -0.170454
H  -2.675724 -1.589381 0.394366
C  -0.517017 -1.142136 0.282753
C  0.610695 -1.125062 -0.503295
C  1.907451 -0.652386 0.065141
H  2.008244 -0.952295 1.113617
H  2.762947 -1.044646 -0.491417
C  1.893823 0.912461 -0.036545
H  2.018285 1.204706 -1.085886
H  2.74157 1.327974 0.514583
C  0.556779 1.481499 0.490676
C  -0.549944 0.829118 -0.264756
H  0.530958 -1.30084 -1.575655
H  -2.068496 -1.205737 -1.238231
H  0.439955 1.357449 1.572137
H  -0.423218 0.892045 -1.348485
H  -2.71797 1.097253 -0.478061
H  0.525787 2.562603 0.278786
H  -0.367182 -1.091157 1.362491
totalener: -311.18084245 hartree
nucrepener: 385.39946110 hartree
electener: -696.58030355 hartree
oneelecener: -1171.06813403 hartree
twoeener: 474.48783048 hartree
kineticenergy: 310.01471209 hartree
exchangeener: -12.763119656706 hartree
correlationener: -0.948202348361 hartree
xcener: -13.711322005067 hartree
chargesum: 1.0000000
charge: -0.202443 0.165071 -0.199939 0.178726 -0.084592 -0.068415 -0.225111 0.159112 0.176642 -0.237422 0.152298 0.174291 -0.207415 -0.020321 0.202219 0.160499 0.152497 0.185033 0.176536 0.183334 0.179399
charge: -0.192183 0.153197 -0.186569 0.149546 -0.061697 -0.026662 -0.206558 0.154291 0.156753 -0.206546 0.146260 0.150563 -0.223938 0.056519 0.164413 0.152123 0.151968 0.171483 0.151896 0.174695 0.170446
qa: -0.2024 0.1651 -0.1999 0.1787 -0.0846 -0.0684 -0.2251 0.1591 0.1766 -0.2374 0.1523 0.1743 -0.2074 -0.0203 0.2022 0.1605 0.1525 0.1850 0.1765 0.1833 0.1794
va: 3.8671 0.9736 3.8672 0.9720 3.8488 3.8096 3.9043 0.9688 0.9685 3.8706 0.9715 0.9665 3.9186 3.6997 0.9476 0.9740 0.9724 0.9542 0.9708 0.9650 0.9604
total: -311.865445022 hartree
energy: -311.865445022247
dipole: 0.56226 -0.77193 -0.20967 1.85430 -1.70535 0.14895 0.18704 -0.37187 -0.18483
magnitude: 0.31672 au
magnitude: 0.80504 debye
