program: Orca
programVersion: 5.0.3
elementType: C H C H C C C H H C H H C C H H H H H H H
charge: 1
multiplicity: 1
keywords: DSD-PBEP86/2013 cc-pVTZ EnGrad D3BJ RIJCOSX verytightscf cc-pVTZ/C def2/J soscf
formula: C8H13
InChI: InChI=1/C8H13/c1-2-4-6-8-7-5-3-1/h1-2,7H,3-6,8H2
21 atoms
C  -1.998823 0.759882 0.070097
H  -2.162407 0.831319 1.148069
C  -1.730077 -0.966628 -0.158198
H  -2.618389 -1.317776 0.371101
C  -0.416526 -1.386741 0.393002
C  0.68618 -1.27636 -0.377526
C  2.001413 -0.69183 0.062897
H  2.209523 -0.889387 1.120035
H  2.855864 -1.034151 -0.526869
C  1.78916 0.858004 -0.140365
H  1.830832 1.118468 -1.203623
H  2.59301 1.406508 0.357579
C  0.421924 1.261533 0.488959
C  -0.767777 1.301036 -0.373424
H  0.521648 -1.20174 -1.457183
H  -1.834153 -1.126926 -1.231714
H  0.188852 0.58111 1.313954
H  -0.659063 1.588678 -1.422817
H  -2.882524 0.991684 -0.522719
H  0.468109 2.247142 0.997338
H  -0.335232 -1.487251 1.474839
totalener: -311.11850298 hartree
nucrepener: 379.49341122 hartree
electener: -690.61191420 hartree
oneelecener: -1159.39777397 hartree
twoeener: 468.78585978 hartree
kineticenergy: 309.72972429 hartree
exchangeener: -14.117017736964 hartree
correlationener: -0.942768045606 hartree
xcener: -15.059785782570 hartree
chargesum: 1.0000000
charge: -0.264182 0.199831 -0.238412 0.200303 -0.150233 -0.124909 -0.234897 0.155823 0.173611 -0.257925 0.158627 0.176906 -0.244914 0.103593 0.163645 0.191013 0.155232 0.232929 0.202942 0.216960 0.184058
charge: 0.133117 0.013877 0.177708 0.007446 0.019966 0.069049 0.075359 -0.004927 -0.003582 0.105017 -0.012637 -0.001757 0.076003 0.311296 -0.017324 -0.000908 0.006878 0.017971 0.006164 0.042796 -0.021512
qa: -0.2642 0.1998 -0.2384 0.2003 -0.1502 -0.1249 -0.2349 0.1558 0.1736 -0.2579 0.1586 0.1769 -0.2449 0.1036 0.1636 0.1910 0.1552 0.2329 0.2029 0.2170 0.1841
va: 3.8851 0.9710 3.9061 0.9652 3.8217 3.8437 3.9048 0.9871 0.9774 3.8873 0.9844 0.9754 3.8942 3.5529 0.9835 0.9719 1.0034 0.9580 0.9722 0.9625 0.9820
dispcorr: -0.014227230 hartree
energy: -311.807085469320
dipole: 0.16485 -1.08923 -0.92438 1.59914 -0.49116 1.10798 0.39145 -0.51662 -0.12517
magnitude: 1.44837 au
magnitude: 3.68145 debye
