program: Orca
programVersion: 5.0.3
elementType: C H C H C C C H H C H H C C H H H H H H H
charge: 1
multiplicity: 1
keywords: DSD-PBEP86/2013 cc-pVTZ EnGrad RIJCOSX verytightscf cc-pVTZ/C def2/J soscf
formula: C8H13
InChI: InChI=1/C8H13/c1-2-4-6-8-7-5-3-1/h1-2,7H,3-6,8H2
21 atoms
C  -2.002446 0.700915 0.072661
H  -2.176429 0.794584 1.148755
C  -1.751422 -0.967389 -0.171501
H  -2.627607 -1.382707 0.333662
C  -0.410732 -1.370595 0.378728
C  0.673393 -1.266852 -0.401749
C  1.983865 -0.707338 0.066288
H  2.179033 -0.930674 1.120421
H  2.845708 -1.038159 -0.521493
C  1.796276 0.831125 -0.123533
H  1.82986 1.093128 -1.186956
H  2.605556 1.377526 0.368249
C  0.438112 1.337379 0.49934
C  -0.753246 1.270249 -0.339465
H  0.515058 -1.192726 -1.482114
H  -1.832315 -1.140808 -1.246707
H  0.257377 0.901111 1.483863
H  -0.655054 1.628224 -1.369036
H  -2.868236 0.991594 -0.523825
H  0.560798 2.434492 0.646493
H  -0.316668 -1.444179 1.461748
totalener: -311.13998202 hartree
nucrepener: 379.09690709 hartree
electener: -690.23688912 hartree
oneelecener: -1158.61280787 hartree
twoeener: 468.37591875 hartree
kineticenergy: 309.72296552 hartree
exchangeener: -12.752024112770 hartree
correlationener: -0.942496207744 hartree
xcener: -13.694520320514 hartree
chargesum: 1.0000000
charge: -0.258291 0.198876 -0.241949 0.194900 -0.166309 -0.142675 -0.237664 0.161669 0.177409 -0.253698 0.159975 0.180685 -0.242324 0.096424 0.168638 0.185261 0.171036 0.242771 0.200048 0.214327 0.190892
charge: 0.122672 0.014725 0.152276 0.004109 0.031537 0.048368 0.069423 -0.003047 0.000374 0.109386 -0.009637 -0.000493 0.081839 0.331023 -0.017821 -0.001440 0.006360 0.023582 0.007866 0.050791 -0.021893
qa: -0.2583 0.1989 -0.2419 0.1949 -0.1663 -0.1427 -0.2377 0.1617 0.1774 -0.2537 0.1600 0.1807 -0.2423 0.0964 0.1686 0.1853 0.1710 0.2428 0.2000 0.2143 0.1909
va: 3.8754 0.9722 3.9095 0.9677 3.8188 3.8487 3.9028 0.9859 0.9766 3.8872 0.9826 0.9725 3.9202 3.5279 0.9820 0.9750 0.9897 0.9505 0.9745 0.9646 0.9788
energy: -311.839946915091
dipole: 0.29693 -1.09283 -0.79590 1.95807 -0.63930 1.31877 0.21821 -0.36029 -0.14208
magnitude: 1.54686 au
magnitude: 3.93181 debye
