program: Orca
programVersion: 5.0.3
elementType: C H C H C C C H H C H H C C H H H H H H H
charge: 1
multiplicity: 1
keywords: PBE0 cc-pVTZ EnGrad RIJCOSX verytightscf cc-pVTZ/C def2/J soscf
formula: C8H13
InChI: InChI=1/C8H13/c1-2-4-6-8-7-5-3-1/h1-2,7H,3-6,8H2
21 atoms
C  -1.991337 0.553194 0.110274
H  -2.167017 0.738066 1.17437
C  -1.890438 -0.978073 -0.174849
H  -2.66702 -1.543728 0.345651
C  -0.47803 -1.236536 0.315608
C  0.629225 -1.188872 -0.47485
C  1.920148 -0.676294 0.071713
H  2.050411 -0.948512 1.124462
H  2.78755 -1.039293 -0.488137
C  1.853175 0.880683 -0.069529
H  1.926187 1.152044 -1.129502
H  2.703315 1.345629 0.437519
C  0.525393 1.466804 0.507452
C  -0.616443 1.013176 -0.299637
H  0.532233 -1.305776 -1.554449
H  -1.972433 -1.175292 -1.248468
H  0.392244 1.252612 1.571769
H  -0.486253 1.142802 -1.377972
H  -2.775553 1.042744 -0.478585
H  0.596187 2.565033 0.393218
H  -0.338653 -1.212202 1.398033
totalener: -312.06613210 hartree
nucrepener: 382.35027768 hartree
electener: -694.41640977 hartree
oneelecener: -1165.64361990 hartree
twoeener: 471.22721013 hartree
kineticenergy: 309.63789465 hartree
exchangeener: -34.157082889113 hartree
correlationener: -1.966513205139 hartree
xcener: -36.123596094253 hartree
chargesum: 1.0000000
charge: -0.160777 0.149652 -0.165461 0.153565 -0.083861 -0.110057 -0.176819 0.140653 0.154835 -0.198722 0.138008 0.153766 -0.167429 -0.003988 0.185385 0.143486 0.147801 0.195971 0.158264 0.180211 0.165517
charge: 0.087554 0.003832 0.090960 0.000104 0.115301 0.104708 0.074070 0.000900 0.007371 0.102812 -0.005101 0.000668 0.067093 0.300913 -0.007716 0.001488 0.003502 0.009308 0.008105 0.037396 -0.003270
qa: -0.1608 0.1497 -0.1655 0.1536 -0.0839 -0.1101 -0.1768 0.1407 0.1548 -0.1987 0.1380 0.1538 -0.1674 -0.0040 0.1854 0.1435 0.1478 0.1960 0.1583 0.1802 0.1655
va: 3.8438 0.9925 3.8737 0.9874 3.8163 3.8225 3.8924 0.9937 0.9879 3.8699 0.9899 0.9852 3.8807 3.6488 0.9813 0.9952 0.9925 0.9771 0.9865 0.9786 0.9927
energy: -312.066132098117
dipole: 0.54464 -0.83196 -0.28732 1.88543 -1.29537 0.59006 0.15716 -0.28224 -0.12508
magnitude: 0.66810 au
magnitude: 1.69819 debye
