program: Orca
programVersion: 5.0.3
elementType: C H C H C C C H H C H H C C H H H H H H H
charge: 1
multiplicity: 1
keywords: b3lyp cc-pVTZ EnGrad D3BJ RIJCOSX verytightscf cc-pVTZ/C def2/J soscf
formula: C8H13
InChI: InChI=1/C8H13/c1-2-4-6-8-7-5-3-1/h1-2,7H,3-6,8H2
21 atoms
C  -1.999455 0.522228 0.115178
H  -2.181722 0.726231 1.173673
C  -1.980634 -1.006446 -0.163189
H  -2.678893 -1.602165 0.425957
C  -0.533323 -1.101191 0.274785
C  0.600479 -1.094806 -0.513122
C  1.904425 -0.640537 0.05714
H  1.998372 -0.955452 1.101847
H  2.749549 -1.045787 -0.505489
C  1.91509 0.926226 -0.021131
H  2.069005 1.233668 -1.061901
H  2.753908 1.319054 0.559361
C  0.566771 1.477881 0.483278
C  -0.522685 0.753976 -0.250775
H  0.521358 -1.286613 -1.582646
H  -2.109626 -1.230853 -1.225802
H  0.454952 1.380423 1.568323
H  -0.409457 0.828807 -1.335573
H  -2.687564 1.113198 -0.496069
H  0.49254 2.54825 0.240466
H  -0.378991 -1.053383 1.353654
totalener: -312.25217385 hartree
nucrepener: 386.75097793 hartree
electener: -699.00315178 hartree
oneelecener: -1174.31609115 hartree
twoeener: 475.31293938 hartree
kineticenergy: 310.01587889 hartree
exchangeener: -36.329829555158 hartree
correlationener: -2.310016025814 hartree
xcener: -38.639845580972 hartree
chargesum: 1.0000000
charge: -0.158618 0.140192 -0.179266 0.154525 -0.022423 -0.018735 -0.187395 0.136086 0.155183 -0.191415 0.134174 0.151831 -0.171332 -0.051742 0.189297 0.138879 0.132167 0.166569 0.152961 0.163042 0.166021
charge: 0.107427 -0.001805 0.110016 -0.002609 0.120418 0.179428 0.089259 0.001079 0.006010 0.101882 -0.007298 -0.001057 0.070793 0.201273 0.002270 -0.002107 -0.003733 0.001915 -0.002471 0.018531 0.010777
qa: -0.1586 0.1402 -0.1793 0.1545 -0.0224 -0.0187 -0.1874 0.1361 0.1552 -0.1914 0.1342 0.1518 -0.1713 -0.0517 0.1893 0.1389 0.1322 0.1666 0.1530 0.1630 0.1660
va: 3.8237 0.9923 3.8434 0.9835 3.7574 3.7363 3.8728 0.9901 0.9831 3.8441 0.9872 0.9810 3.8472 3.7013 0.9761 0.9927 0.9918 0.9951 0.9814 0.9765 0.9938
dispcorr: -0.035066698 hartree
energy: -312.287240548853
dipole: 0.55611 -0.67137 -0.11526 1.84908 -1.86507 -0.01599 0.20209 -0.36525 -0.16316
magnitude: 0.20040 au
magnitude: 0.50937 debye
