program: Orca
programVersion: 5.0.3
elementType: C H C H C C C H H C H H C C H H H H H H H
charge: 1
multiplicity: 1
keywords: b3lyp cc-pVTZ EnGrad D3BJ RIJCOSX verytightscf cc-pVTZ/C def2/J soscf
formula: C8H13
InChI: InChI=1/C8H13/c1-2-4-6-8-7-5-3-1/h1-2,7H,3-6,8H2
21 atoms
C  -1.994847 0.538912 0.118492
H  -2.170767 0.727541 1.181287
C  -1.927856 -0.988595 -0.173392
H  -2.672866 -1.571904 0.371364
C  -0.500787 -1.18354 0.294978
C  0.618491 -1.152679 -0.492777
C  1.911549 -0.662715 0.068908
H  2.023149 -0.95109 1.119536
H  2.773661 -1.042259 -0.486919
C  1.875506 0.899231 -0.049909
H  1.976302 1.181689 -1.104663
H  2.726816 1.33548 0.479628
C  0.545077 1.479598 0.498377
C  -0.576987 0.90604 -0.280009
H  0.533511 -1.308019 -1.568042
H  -2.028382 -1.189903 -1.24433
H  0.421084 1.322428 1.574341
H  -0.442187 0.976418 -1.362398
H  -2.743937 1.076158 -0.473474
H  0.557806 2.569716 0.323906
H  -0.354541 -1.138018 1.375722
totalener: -312.24597352 hartree
nucrepener: 384.06534741 hartree
electener: -696.31132093 hartree
oneelecener: -1169.04255525 hartree
twoeener: 472.73123432 hartree
kineticenergy: 309.99236555 hartree
exchangeener: -36.315346784470 hartree
correlationener: -2.307388061215 hartree
xcener: -38.622734845685 hartree
chargesum: 1.0000000
charge: -0.163869 0.142160 -0.168394 0.153235 -0.052372 -0.063719 -0.184911 0.134703 0.153592 -0.188049 0.130792 0.152750 -0.165521 -0.012155 0.183892 0.137758 0.137772 0.182133 0.154913 0.172492 0.162797
charge: 0.094702 -0.000445 0.098845 -0.002058 0.125533 0.137569 0.082084 -0.000649 0.005385 0.103214 -0.007240 -0.001340 0.070053 0.265976 -0.005422 -0.001219 -0.000642 0.002955 0.002890 0.028943 0.000865
qa: -0.1639 0.1422 -0.1684 0.1532 -0.0524 -0.0637 -0.1849 0.1347 0.1536 -0.1880 0.1308 0.1528 -0.1655 -0.0122 0.1839 0.1378 0.1378 0.1821 0.1549 0.1725 0.1628
va: 3.8228 0.9910 3.8401 0.9831 3.7733 3.7727 3.8733 0.9912 0.9832 3.8367 0.9883 0.9803 3.8506 3.6431 0.9789 0.9930 0.9913 0.9856 0.9816 0.9749 0.9927
dispcorr: -0.036373684 hartree
energy: -312.282347203597
dipole: 0.56195 -0.77588 -0.21394 1.86114 -1.54895 0.31220 0.17409 -0.30956 -0.13547
magnitude: 0.40198 au
magnitude: 1.02175 debye
