program: Orca
programVersion: 5.0.3
elementType: C H C H C C C H H C H H C C H H H H H H H
charge: 1
multiplicity: 1
keywords: b3lyp def2-TZVP EnGrad RIJCOSX verytightscf def2/J soscf
formula: C8H13
InChI: InChI=1/C8H13/c1-2-4-6-8-7-5-3-1/h1-2,7H,3-6,8H2
21 atoms
C  -1.998823 0.759882 0.070097
H  -2.162407 0.831319 1.148069
C  -1.730077 -0.966628 -0.158198
H  -2.618389 -1.317776 0.371101
C  -0.416526 -1.386741 0.393002
C  0.68618 -1.27636 -0.377526
C  2.001413 -0.69183 0.062897
H  2.209523 -0.889387 1.120035
H  2.855864 -1.034151 -0.526869
C  1.78916 0.858004 -0.140365
H  1.830832 1.118468 -1.203623
H  2.59301 1.406508 0.357579
C  0.421924 1.261533 0.488959
C  -0.767777 1.301036 -0.373424
H  0.521648 -1.20174 -1.457183
H  -1.834153 -1.126926 -1.231714
H  0.188852 0.58111 1.313954
H  -0.659063 1.588678 -1.422817
H  -2.882524 0.991684 -0.522719
H  0.468109 2.247142 0.997338
H  -0.335232 -1.487251 1.474839
totalener: -312.20981394 hartree
nucrepener: 379.49341122 hartree
electener: -691.70322516 hartree
oneelecener: -1160.06349033 hartree
twoeener: 468.36026517 hartree
kineticenergy: 310.53235571 hartree
exchangeener: -36.317430431500 hartree
correlationener: -2.303541594010 hartree
xcener: -38.620972025511 hartree
chargesum: 1.0000000
charge: -0.233100 0.188051 -0.202988 0.185925 -0.175313 -0.059904 -0.211050 0.146789 0.155662 -0.251895 0.146537 0.159161 -0.125358 0.082560 0.127014 0.179069 0.139724 0.198968 0.184701 0.204228 0.161219
charge: -0.159036 0.170729 -0.115047 0.163080 -0.183954 -0.110210 -0.216425 0.150729 0.150579 -0.202167 0.144983 0.153780 -0.206986 0.094236 0.152680 0.155099 0.176296 0.170648 0.160525 0.200558 0.149902
qa: -0.2331 0.1881 -0.2030 0.1859 -0.1753 -0.0599 -0.2110 0.1468 0.1557 -0.2519 0.1465 0.1592 -0.1254 0.0826 0.1270 0.1791 0.1397 0.1990 0.1847 0.2042 0.1612
va: 3.8566 0.9591 3.8162 0.9561 3.8131 3.8018 3.8560 0.9696 0.9729 3.8960 0.9676 0.9675 3.7427 3.5944 0.9688 0.9594 1.0036 0.9525 0.9655 0.9482 0.9666
energy: -312.209813944434
dipole: 0.16485 -1.02133 -0.85648 1.59914 -0.52193 1.07721 0.39145 -0.50279 -0.11134
magnitude: 1.38070 au
magnitude: 3.50946 debye
