program: Orca
programVersion: 5.0.3
elementType: C H C H C C C H H C H H C C H H H H H H H
charge: 1
multiplicity: 1
keywords: m062x cc-pVTZ EnGrad RIJCOSX verytightscf cc-pVTZ/C def2/J soscf
formula: C8H13
InChI: InChI=1/C8H13/c1-2-4-6-8-7-5-3-1/h1-2,7H,3-6,8H2
21 atoms
C  -1.9941 0.541562 0.117355
H  -2.169777 0.729399 1.180414
C  -1.920344 -0.986411 -0.173882
H  -2.671897 -1.566521 0.365635
C  -0.496189 -1.194793 0.29888
C  0.620616 -1.160216 -0.489484
C  1.912981 -0.665514 0.069653
H  2.028051 -0.950682 1.120781
H  2.776511 -1.041601 -0.486546
C  1.870692 0.895492 -0.05375
H  1.965376 1.175519 -1.109749
H  2.722325 1.337546 0.470537
C  0.541428 1.477991 0.500447
C  -0.584781 0.927844 -0.284228
H  0.533593 -1.308779 -1.56561
H  -2.017013 -1.186374 -1.245506
H  0.415453 1.310311 1.574474
H  -0.449312 1.00548 -1.366175
H  -2.750733 1.069647 -0.473587
H  0.566326 2.570198 0.337476
H  -0.351106 -1.152379 1.379958
totalener: -312.30557223 hartree
nucrepener: 383.70186791 hartree
electener: -696.00744015 hartree
oneelecener: -1168.04217338 hartree
twoeener: 472.03473323 hartree
kineticenergy: 310.02096499 hartree
xcener: -23.093668332688 hartree
chargesum: 1.0000000
charge: -0.265738 0.194032 -0.277302 0.189283 -0.095930 -0.082455 -0.311929 0.189616 0.190533 -0.269820 0.180450 0.191848 -0.306792 -0.015320 0.232396 0.187752 0.200408 0.238420 0.192418 0.222134 0.215996
charge: 0.089369 0.002442 0.093397 0.000379 0.117310 0.126047 0.075223 0.001526 0.006988 0.098622 -0.005195 0.000934 0.063862 0.281046 -0.003851 0.001182 0.002674 0.007734 0.005758 0.032914 0.001640
qa: -0.2657 0.1940 -0.2773 0.1893 -0.0959 -0.0825 -0.3119 0.1896 0.1905 -0.2698 0.1805 0.1918 -0.3068 -0.0153 0.2324 0.1878 0.2004 0.2384 0.1924 0.2221 0.2160
va: 3.7197 0.9594 3.7542 0.9597 3.6408 3.6175 3.7888 0.9577 0.9604 3.7218 0.9557 0.9518 3.7545 3.4894 0.9392 0.9633 0.9529 0.9397 0.9572 0.9458 0.9506
energy: -312.305572233997
dipole: 0.56021 -0.81115 -0.25094 1.86445 -1.45313 0.41133 0.17048 -0.31196 -0.14148
magnitude: 0.50217 au
magnitude: 1.27642 debye
