program: Orca
programVersion: 5.0.3
charge: 1
multiplicity: 1
keywords: DLPNO-CCSD(T1) tightPNO Extrapolate(3/4,def2) RIJK def2/JK verytightSCF miniprint nopop
formula: C8H13
InChI: InChI=1/C8H13/c1-2-4-6-8-7-5-3-1/h1-2,7H,3-6,8H2
21 atoms
C  -1.996975 0.518036 0.098601
H  -2.187666 0.747785 1.150253
C  -1.996188 -1.015746 -0.146621
H  -2.682987 -1.597653 0.468833
C  -0.542865 -1.086784 0.278775
C  0.586157 -1.071387 -0.521172
C  1.901934 -0.631349 0.041056
H  2.002501 -0.969803 1.077878
H  2.733866 -1.039923 -0.538396
C  1.930933 0.935625 -0.001964
H  2.113469 1.266311 -1.030737
H  2.756913 1.307351 0.610034
C  0.571037 1.47347 0.482542
C  -0.502978 0.715989 -0.250467
H  0.49846 -1.273147 -1.58798
H  -2.139135 -1.267592 -1.201136
H  0.452758 1.384056 1.56773
H  -0.392002 0.802993 -1.334772
H  -2.6631 1.110344 -0.534304
H  0.474935 2.538443 0.229253
H  -0.379216 -1.040052 1.356098
e0: -310.329229727 hartree
corrType: DLPNO BASED
e0: -310.342839816 hartree
basis: def2-TZVPP def2-QZVPP
scfener: -310.329229727 -310.342839816
corrmethod: MDCI MDCI
correner: -1.452863112 -1.522973330
corrcbsextra: -1.574906786
energy: -311.919621237904
dipole: 0.55177 -0.68931 -0.13754 1.84321 -1.99308 -0.14987 0.21798 -0.43323 -0.21524
magnitude: 0.29616 au
magnitude: 0.75277 debye
