program: Orca
programVersion: 5.0.3
elementType: C H C H C C C H H C H H C C H H H H H H H
charge: 1
multiplicity: 1
keywords: DSD-PBEP86 def2-TZVP D3BJ RIJCOSX verytightscf def2-TZVP/C def2/J soscf noTRAH
formula: C8H13
InChI: InChI=1/C8H12.H/c1-2-4-6-8-7-5-3-1;/h1-2,7-8H,3-6H2;
21 atoms
C  -1.972039 0.651332 0.127162
H  -2.117572 0.84232 1.195136
C  -1.853488 -0.949375 -0.116715
H  -2.653432 -1.44145 0.439524
C  -0.471324 -1.348786 0.370954
C  0.671511 -1.255694 -0.387046
C  1.972551 -0.653767 0.115754
H  2.121014 -0.85404 1.181539
H  2.844799 -1.012798 -0.433221
C  1.852316 0.951585 -0.113727
H  1.979447 1.17404 -1.177662
H  2.655012 1.436613 0.44452
C  0.472752 1.348564 0.380856
C  -0.671539 1.259938 -0.372949
H  0.551389 -1.263283 -1.473308
H  -1.983433 -1.163732 -1.18211
H  -0.001753 -0.001193 -0.01764
H  -0.555171 1.281676 -1.460103
H  -2.845537 1.017858 -0.415327
H  0.349294 1.322539 1.47147
H  -0.346556 -1.347257 1.455136
totalener: -311.07846495 hartree
nucrepener: 382.95291103 hartree
electener: -694.03137598 hartree
oneelecener: -1165.79312237 hartree
twoeener: 471.76174639 hartree
kineticenergy: 309.95257307 hartree
exchangeener: -13.663450821384 hartree
correlationener: -0.928137174175 hartree
xcener: -14.591587995559 hartree
chargesum: 1.0000000
charge: -0.234190 0.166322 -0.230514 0.181066 -0.090058 -0.088688 -0.235107 0.166394 0.181423 -0.232184 0.166252 0.181226 -0.086599 -0.093523 0.172200 0.166394 0.215828 0.171798 0.181208 0.170194 0.170558
charge: -0.193717 0.150729 -0.193776 0.154120 -0.102161 -0.107109 -0.193079 0.150675 0.153956 -0.193660 0.150630 0.154066 -0.103598 -0.109094 0.163222 0.150756 0.323702 0.163188 0.153951 0.164352 0.162844
qa: -0.2342 0.1663 -0.2305 0.1811 -0.0901 -0.0887 -0.2351 0.1664 0.1814 -0.2322 0.1663 0.1812 -0.0866 -0.0935 0.1722 0.1664 0.2158 0.1718 0.1812 0.1702 0.1706
va: 3.8978 0.9700 3.8932 0.9675 3.8545 3.8407 3.8989 0.9700 0.9675 3.8954 0.9701 0.9673 3.8512 3.8448 0.9644 0.9701 0.9891 0.9644 0.9675 0.9646 0.9645
total: -311.763421763 hartree
dispcorr: -0.012016568 hartree
energy: -311.775438330655
dipole: -0.00306 0.00523 0.00217 -0.01228 0.00250 -0.00978 0.01732 -0.01529 0.00204
magnitude: 0.01022 au
magnitude: 0.02598 debye
