program: Gaussian 09
title: 000051236
version: EM64L-G09RevD.01
frameworkgroup: C1[X(C18H21N5S)]
method: RPBEPBE
basis: SDD
operation: Freq
keyword: #p
keyword: freq=noraman
keyword: PBEPBE/SDD
title: #p freq=noraman PBEPBE/SDD
converged: YES YES NO NO
title: Mulliken charges:
elementType: S N N N N N C C C C C C C C C C C C C C C C C C H H H H H H H H H H H H H H H H H H H H H
charge: 0.252022 -0.504553 -0.127796 -0.058523 -0.389993 -0.157657 -0.095619 -0.363077 0.363776 0.217399 -0.691277 0.241921 -0.082722 -0.427204 -0.696365 0.129976 -0.326627 -0.331322 -0.292475 -0.231861 -0.795054 -0.106423 -0.495526 -0.120633 0.143663 0.186995 0.206948 0.235520 0.213330 0.211013 0.404701 0.312890 0.197618 0.244601 0.216374 0.229569 0.260937 0.337657 0.221490 0.227773 0.249632 0.225675 0.225272 0.275083 0.262872
chargesum: 0.00000
title: Mulliken charges with hydrogens summed into heavy atoms:
elementType: S N N N N N C C C C C C C C C C C C C C C C C C
charge: 0.252022 -0.099853 -0.127796 -0.058523 -0.052336 -0.157657 0.048044 0.030866 0.363776 0.217399 -0.031414 0.241921 -0.082722 -0.114314 -0.037772 0.129976 -0.097058 -0.070385 -0.070986 -0.004088 -0.094475 -0.106423 -0.220442 0.142239
polarizability: 3.34427923e+02 3.40412895e+00 3.52042926e+02 -2.96823754e+00 -9.35575294e+00 1.25757679e+02
1716.lowfreq: -5.7064 0.0004 0.0008 0.0008 2.0676 6.1952 18.7504 23.3327 32.8390
frequency: 18.2641 23.0861 32.8327 52.9270 62.4985 72.6749 77.2536 93.4840 99.3704 116.2324 134.4007 159.0466 177.3803 181.5488 209.0939 222.3913 230.1123 236.9410 253.9763 274.9178 294.9674 313.8161 345.2559 381.5310 437.6359 439.0464 470.5890 475.5580 485.0969 493.8138 521.3180 523.0665 533.8926 539.5929 586.7101 594.8694 617.6490 637.9422 659.5451 663.8059 673.5765 680.3892 699.6287 755.5293 765.9067 778.5570 788.5043 805.4635 814.2996 841.9156 853.9737 860.2960 866.5145 870.7977 894.7718 939.6601 945.3287 960.1019 965.9755 981.7859 991.0528 996.4446 1013.6253 1031.1124 1036.7534 1042.0877 1046.7282 1079.5321 1104.0491 1108.8220 1122.6646 1135.5830 1169.7414 1175.9490 1193.2279 1236.6671 1244.9857 1257.8192 1264.3453 1270.0201 1279.6888 1283.0192 1330.5428 1343.9910 1357.3800 1380.3400 1382.1984 1387.8160 1391.2522 1393.7985 1426.1607 1450.7767 1453.7567 1463.3913 1463.9267 1465.5125 1467.2351 1475.8075 1479.8402 1488.5950 1494.7283 1505.3937 1548.5589 1552.6895 1579.1843 1615.7814 1634.3990 1667.0983 2811.8288 2975.6259 2978.8646 2979.7649 2983.0289 3037.5556 3056.9545 3070.1398 3074.4211 3086.8707 3089.1978 3115.3347 3118.3165 3133.0333 3150.7767 3168.5342 3185.0222 3190.8342 3204.6409 3259.5718 3551.2970
redmass: 4.1054 3.4838 5.5160 5.2257 5.4900 1.2338 3.5596 3.1030 3.7530 2.7191 2.7812 4.6370 3.6937 4.4781 4.4182 1.1401 2.3230 1.6855 4.4855 3.2552 3.4890 4.7865 3.5306 3.2244 3.2932 5.0907 3.7431 4.9598 3.1159 3.6046 4.0345 3.9982 1.9521 3.1442 4.3183 7.4297 4.3293 5.8713 3.4080 5.7479 6.4022 5.4492 1.3169 2.2603 1.4440 3.7050 2.6037 2.8775 2.7741 3.2229 3.5962 1.5245 1.4071 3.8335 1.2424 1.2848 1.8747 1.3553 2.3593 1.8533 1.3215 1.7508 2.0682 2.4692 3.2411 2.1705 1.5946 1.7311 2.3509 2.0485 1.8325 2.0568 1.9113 1.4816 1.4438 2.4919 2.8658 1.2005 1.3507 2.9565 1.7603 2.1100 1.5214 2.7258 1.4443 1.6503 1.2045 1.2263 3.0000 4.8764 2.0520 1.9304 1.1589 1.5006 1.2992 1.3199 1.0480 1.0445 1.0621 1.0561 4.1523 3.0379 6.4080 6.8933 4.4714 4.1545 3.4050 2.2136 1.0799 1.0373 1.0399 1.0380 1.0546 1.1005 1.0970 1.0993 1.0998 1.1000 1.0998 1.0982 1.0862 1.0895 1.0949 1.0990 1.0929 1.0830 1.0929 1.1015 1.0762
irintensity: 0.0279 0.0619 0.1396 0.0152 0.2258 1.0326 0.2875 0.0473 0.3897 1.6468 0.4399 3.4275 2.7944 2.4301 2.8982 0.0586 0.2617 0.7426 4.4203 1.2073 1.7203 2.1875 0.8716 2.1335 2.7143 16.2154 2.4908 9.0418 5.9078 1.2204 1.4030 2.9290 58.2027 25.6720 17.7030 5.1714 0.7247 5.3238 0.0752 19.0918 2.3598 3.5296 68.4411 5.5862 57.2740 0.4175 13.5214 4.8378 24.8631 2.2524 8.0545 43.0089 1.9421 2.5687 31.1949 18.2572 4.3824 11.2859 5.4128 30.4251 0.0292 5.6813 6.1714 27.8612 2.5943 37.2703 8.4173 1.5271 25.2975 28.4926 10.7752 95.7445 24.8290 9.3490 2.6641 24.7311 138.8301 13.9199 1.8957 56.8801 4.0534 150.1287 23.7835 1.5370 116.9985 28.5633 9.9116 30.2972 28.9747 41.2148 108.9961 4.7042 4.8634 27.0993 72.9852 163.8126 15.9857 5.7586 1.6092 9.4704 99.9369 9.6905 310.1206 56.1322 623.3776 51.7726 416.5326 443.5976 104.5816 38.9264 14.9849 23.6424 59.1683 16.6336 20.8554 48.1329 42.5965 39.6476 53.8533 14.6396 0.0844 10.6490 27.3513 28.9403 9.3888 458.7874 4.7406 3.1547 76.0213
temp: 298.150 k
press: 1.00000 atm
elementType: 16 7 7 7 7 7 6 6 6 6 6 6 6 6 6 6 6 6 6 6 6 6 6 6 1 1 1 1 1 1 1 1 1 1 1 1 1 1 1 1 1 1 1 1 1
symmnumber: 1
zpe: 945006.8 jmol-1
zpe.correction: 0.359934 hartree
zpe.thermalcorrener: 0.383157 hartree
zpe.thermalcorrenthalpy: 0.384101 hartree
zpe.thermalcorrgfe: 0.305234 hartree
zpe.sumelectzpe: -1368.605939 hartree
zpe.sumelectthermal: -1368.582716 hartree
zpe.sumelectthermalent: -1368.581772 hartree
zpe.sumelectthermalfe: -1368.660639 hartree
dipole: 6.3849 -1.5118 -0.0453
dipole: 6.5616
quadrupole: -148.4647 -127.2252 -156.9686
quadrupole: 1.6569 -0.6937 -1.9311
quadrupole: -4.2452 16.9943 -12.7491 1.6569 -0.6937 -1.9311
hfenergy: -1368.9658727 hartree
pointgroup: C01 [X(C18H21N5S1)]
dipole: 2.4507354 -0.7787823 -0.2273741 debye
polarizability: 333.2930773|4.5813105|351.7832926|-19.3194725|-2.7582551|127.1521579 unknown
InChI: InChI=1S/C18H21N5S/c1-4-12(2)21-17(23-18-19-9-10-24-18)22-16-11-13(3)20-15-8-6-5-7-14(15)16/h5-12,22-23H,4H2,1-3H3
charge 0 multiplicity 1
45 atoms
S  4.425596 -2.426567 -0.413425
N  0.275034 -0.211466 -0.137723
N  1.472222 1.855355 -0.279737
N  -3.813546 1.054108 0.165627
N  2.636524 -0.262076 -0.333862
N  1.755951 -2.507057 -0.21597
C  2.729877 2.619617 -0.443194
C  2.555076 3.997595 0.243307
C  -1.055489 0.237668 -0.037467
C  -2.10056 -0.769147 0.074465
C  3.062671 2.780515 -1.949628
C  1.436716 0.548493 -0.251559
C  -3.464814 -0.293661 0.172254
C  -1.429549 1.59005 -0.040823
C  2.330605 3.888807 1.764085
C  -2.8117 1.954542 0.062349
C  -1.862898 -2.181736 0.09422
C  -4.529506 -1.244054 0.283095
C  -2.924033 -3.086833 0.204277
C  -4.268949 -2.61636 0.299172
C  -3.196651 3.42051 0.056968
C  2.759639 -1.63576 -0.30721
C  3.570752 -4.017015 -0.320161
C  2.20815 -3.832664 -0.223891
H  3.6023 2.128753 0.065902
H  3.452572 4.612482 0.031613
H  1.690375 4.501931 -0.230024
H  2.229777 3.29669 -2.45892
H  3.981088 3.38099 -2.084044
H  3.205824 1.804245 -2.448848
H  0.444608 -1.236909 -0.132687
H  -0.656377 2.354148 -0.124989
H  3.202629 3.428033 2.267254
H  1.444857 3.264031 1.974989
H  2.168492 4.883717 2.216763
H  -0.84423 -2.580581 0.024113
H  -5.545855 -0.844468 0.35432
H  3.497235 0.283555 -0.392281
H  -2.722774 -4.163871 0.218333
H  -5.092755 -3.333646 0.384532
H  -4.290185 3.516283 0.139503
H  -2.724322 3.958791 0.900401
H  -2.861478 3.916425 -0.873497
H  4.142403 -4.940962 -0.343399
H  1.4771 -4.638204 -0.154803
