program: Orca
programVersion: 5.0.3
elementType: C H C H C C C H H C H H C C H H H H H H H
charge: 1
multiplicity: 1
keywords: DSD-PBEP86 def2-TZVP D3BJ RIJCOSX verytightscf def2-TZVP/C def2/J soscf noTRAH
formula: C8H13
InChI: InChI=1/C8H13/c1-2-4-6-8-7-5-3-1/h1-2,7H,3-6,8H2
21 atoms
C  -1.998339 0.75978 0.070474
H  -2.163256 0.83412 1.148088
C  -1.730615 -0.964666 -0.157114
H  -2.618364 -1.316722 0.372606
C  -0.417467 -1.386087 0.393727
C  0.686796 -1.277231 -0.3763
C  2.00195 -0.691041 0.063101
H  2.210618 -0.887294 1.120398
H  2.856141 -1.033635 -0.526784
C  1.78975 0.860914 -0.141242
H  1.833106 1.120234 -1.204673
H  2.593797 1.408585 0.357239
C  0.421775 1.258921 0.486987
C  -0.767682 1.302657 -0.375002
H  0.522481 -1.203581 -1.456049
H  -1.835038 -1.1258 -1.230465
H  0.183853 0.556153 1.29238
H  -0.658541 1.577396 -1.4278
H  -2.881971 0.990226 -0.523044
H  0.461553 2.225289 1.030304
H  -0.336615 -1.489372 1.475453
totalener: -311.10241359 hartree
nucrepener: 379.55822723 hartree
electener: -690.66064082 hartree
oneelecener: -1159.54031662 hartree
twoeener: 468.87967580 hartree
kineticenergy: 310.00894061 hartree
exchangeener: -13.665002192196 hartree
correlationener: -0.921748925731 hartree
xcener: -14.586751117927 hartree
chargesum: 1.0000000
charge: -0.272349 0.199917 -0.197277 0.193612 -0.210098 -0.106895 -0.214162 0.154839 0.165395 -0.273210 0.152611 0.168829 -0.143977 0.105523 0.140256 0.186669 0.147084 0.213676 0.195886 0.218931 0.174740
charge: -0.166730 0.168321 -0.112986 0.158364 -0.190723 -0.118791 -0.213693 0.148137 0.147452 -0.201761 0.141395 0.150150 -0.210974 0.149823 0.150923 0.152725 0.176072 0.173373 0.157821 0.192615 0.148487
qa: -0.2723 0.1999 -0.1973 0.1936 -0.2101 -0.1069 -0.2142 0.1548 0.1654 -0.2732 0.1526 0.1688 -0.1440 0.1055 0.1403 0.1867 0.1471 0.2137 0.1959 0.2189 0.1747
va: 3.8725 0.9583 3.8341 0.9568 3.8400 3.8543 3.8696 0.9720 0.9739 3.9070 0.9693 0.9689 3.7551 3.5489 0.9684 0.9590 1.0028 0.9458 0.9650 0.9424 0.9627
total: -311.776156373 hartree
dispcorr: -0.011914657 hartree
energy: -311.788071030360
dipole: 0.15706 -1.06932 -0.91226 1.55031 -0.33635 1.21396 0.40052 -0.57232 -0.17181
magnitude: 1.52821 au
magnitude: 3.88441 debye
