program: Gaussian 09
title: 000051212
version: EM64L-G09RevD.01
frameworkgroup: C1[X(C14H12ClN2O)]
method: RPBEPBE
basis: SDD
operation: Freq
keyword: #p
keyword: freq=noraman
keyword: PBEPBE/SDD
title: #p freq=noraman PBEPBE/SDD
converged: YES YES NO NO
title: Mulliken charges:
elementType: Cl O N N C C C C C C C C C C C C C C H H H H H H H H H H H H
charge: 0.012452 -0.399714 -0.153575 -0.383842 -0.253696 0.301024 0.253438 -0.018451 0.343879 -0.314138 -0.302123 -0.354524 -0.351186 -0.200603 -0.184301 -0.194018 -0.186546 -0.131229 0.258443 0.332036 0.376692 0.259088 0.271254 0.247395 0.299912 0.264235 0.267097 0.387766 0.276008 0.277227
chargesum: 1.00000
title: Mulliken charges with hydrogens summed into heavy atoms:
elementType: Cl O N N C C C C C C C C C C C C C C
charge: 0.012452 -0.011948 -0.153575 -0.007150 0.004748 0.301024 0.253438 0.313585 0.343879 -0.055050 -0.030869 -0.107129 -0.051273 0.063631 0.082797 0.081990 0.090681 -0.131229
polarizability: 2.60861373e+02 -1.09595455e+01 1.32423350e+02 -2.32856488e+01 4.40151901e+00 1.20742634e+02
1716.lowfreq: -11.8471 -4.1350 -0.0011 0.0021 0.0024 1.1830 15.2086 27.6692 44.5059
frequency: 15.0233 27.5893 44.4836 96.4421 131.1385 149.6747 182.4892 219.6211 228.6626 270.0333 291.4864 316.5588 350.3383 406.3214 413.8219 424.7680 462.4290 484.9852 513.5077 545.0429 570.6332 607.6647 623.7686 641.7569 676.9737 698.1422 702.8528 744.2969 758.4214 765.9860 783.0390 813.3641 840.8264 859.8087 864.4254 867.8613 876.3703 957.6400 960.5301 987.4604 1001.8162 1004.2032 1011.0078 1013.3658 1035.3383 1078.2188 1108.0826 1118.0935 1152.0447 1155.0795 1180.7974 1190.0064 1198.6551 1220.7250 1241.0758 1274.5273 1293.9845 1299.9090 1355.7222 1371.9947 1393.5106 1401.3309 1409.2541 1422.0270 1458.4117 1480.9180 1487.5915 1522.4351 1584.1905 1602.1393 1613.0173 1628.8039 3009.9386 3125.9415 3158.4229 3165.7213 3168.4031 3176.4493 3176.6227 3185.8861 3189.5320 3263.7577 3575.5521 3589.6753
redmass: 5.6570 4.8540 5.8192 5.8165 5.7506 6.6675 7.8109 4.2542 4.8290 1.9038 5.4966 2.8025 3.7272 2.9921 3.1055 4.1575 4.6048 4.2493 4.6476 6.9730 3.4760 4.7409 7.1005 4.2510 5.3346 2.5984 1.4886 4.3599 4.5402 1.2769 4.2113 2.3798 1.4881 1.7483 1.4452 1.5376 3.7751 1.3644 1.3584 1.3497 4.1904 1.3579 4.0451 2.5491 5.7335 3.0210 1.8270 1.3661 1.3951 1.3212 1.1429 1.1883 1.5661 1.7675 2.1718 2.5887 1.6020 1.2673 1.4335 3.5378 2.3854 2.2755 3.2590 4.6662 2.5269 2.4466 2.4995 4.5932 7.4294 6.0867 7.0917 7.0590 1.0856 1.0908 1.0887 1.0908 1.0894 1.0965 1.0955 1.0972 1.1007 1.1025 1.0834 1.0676
irintensity: 1.8826 0.3995 1.1096 1.6336 5.0284 1.7521 0.4497 19.5882 26.6357 82.1606 7.3665 36.0248 29.9857 0.6588 5.4392 19.6038 27.3822 16.5808 4.8535 5.5865 0.9688 8.5318 1.0155 6.9024 1.3310 48.7400 76.0068 68.2791 9.0303 139.6729 59.2934 40.6239 5.9208 21.3540 3.3881 4.8185 16.6407 0.8465 2.6434 3.1064 47.2859 1.0314 101.6661 22.6606 23.5890 68.6329 34.9080 4.5178 59.4834 24.2152 1.9231 18.5824 59.8895 54.6064 41.1334 7.0286 2.7158 2.0124 11.3508 14.1876 10.7000 13.5238 44.3561 30.1942 11.5463 53.3840 12.7285 45.4785 3.7501 44.5886 23.0397 2.3055 10.5106 8.7470 0.8594 1.6105 0.1298 1.3840 0.2509 0.4519 0.6823 41.9768 158.2483 40.0196
temp: 298.150 k
press: 1.00000 atm
elementType: 17 8 7 7 6 6 6 6 6 6 6 6 6 6 6 6 6 6 1 1 1 1 1 1 1 1 1 1 1 1
symmnumber: 1
zpe: 605731.6 jmol-1
zpe.correction: 0.230711 hartree
zpe.thermalcorrener: 0.245637 hartree
zpe.thermalcorrenthalpy: 0.246581 hartree
zpe.thermalcorrgfe: 0.186266 hartree
zpe.sumelectzpe: -1183.996709 hartree
zpe.sumelectthermal: -1183.981783 hartree
zpe.sumelectthermalent: -1183.980839 hartree
zpe.sumelectthermalfe: -1184.041154 hartree
dipole: -9.7340 -1.3736 -1.2228
dipole: 9.9061
quadrupole: -62.8893 -87.8268 -97.7665
quadrupole: 6.0959 -2.7176 9.4132
quadrupole: 19.9382 -4.9993 -14.9389 6.0959 -2.7176 9.4132
hfenergy: -1184.2274202 hartree
pointgroup: C01 [X(C14H12Cl1N2O1)]
dipole: -3.8953853 -0.0509247 0.1137478 debye
polarizability: 250.617796|-24.8504274|121.5777415|35.7319861|-3.9665466|141.8318187 unknown
InChI: InChI=1S/C14H12ClN2O/c15-11-7-5-10(6-8-11)14(18)17-9-16-12-3-1-2-4-13(12)17/h1-9,14,16,18H
charge 1 multiplicity 1
30 atoms
Cl 5.812166 0.263819 1.631985
O  0.277887 -1.762394 -1.705517
N  -0.75353 -0.271899 -0.119014
N  -1.930332 -0.51739 1.743916
C  0.377585 -0.451363 -1.130901
C  -2.066333 0.18897 -0.404978
C  -2.822104 0.036748 0.796337
C  -0.708997 -0.692473 1.170944
C  1.723691 -0.288732 -0.438971
C  -2.646299 0.722547 -1.574629
C  -4.178338 0.407983 0.880529
C  2.097009 0.980649 0.07174
C  2.60899 -1.385445 -0.320831
C  -4.0035 1.092436 -1.493287
C  -4.755003 0.938199 -0.290573
C  3.344685 1.154887 0.70467
C  3.860223 -1.22194 0.313931
C  4.210485 0.04535 0.821756
H  0.209278 0.353967 -1.873354
H  0.171037 -1.101812 1.659371
H  -2.153765 -0.746983 2.713975
H  -2.086749 0.855135 -2.505167
H  -4.759908 0.294451 1.799681
H  1.429701 1.845585 -0.029594
H  2.328596 -2.353521 -0.744083
H  -4.495549 1.511344 -2.37596
H  -5.806062 1.240852 -0.278718
H  -0.307063 -1.782816 -2.503096
H  3.644922 2.132781 1.091053
H  4.552677 -2.063633 0.402584
