program: Gaussian 09
title: 000051245
version: EM64L-G09RevD.01
frameworkgroup: C1[X(C20H25N5S)]
method: RPBEPBE
basis: SDD
operation: Freq
keyword: #p
keyword: freq=noraman
keyword: PBEPBE/SDD
title: #p freq=noraman PBEPBE/SDD
converged: YES YES NO NO
title: Mulliken charges:
elementType: S N N N N N C C C C C C C C C C C C C C C C C C C C H H H H H H H H H H H H H H H H H H H H H H H H H
charge: 0.248988 -0.120607 -0.506289 -0.039411 -0.386338 -0.156370 0.176056 0.356985 0.201008 -0.694924 -0.696549 -0.697942 0.147294 -0.496986 -0.461041 -0.087487 0.220336 -0.361654 -0.324322 -0.339488 -0.690708 -0.296678 -0.233997 -0.105525 -0.496189 -0.120051 0.241535 0.188776 0.220641 0.225454 0.225451 0.194915 0.242963 0.223070 0.186546 0.220588 0.196633 0.320789 0.401641 0.205530 0.223014 0.231467 0.261326 0.326924 0.207480 0.217233 0.214399 0.221072 0.227386 0.274623 0.262431
chargesum: 0.00000
title: Mulliken charges with hydrogens summed into heavy atoms:
elementType: S N N N N N C C C C C C C C C C C C C C C C C C C C
charge: 0.248988 -0.120607 -0.104648 -0.039411 -0.059414 -0.156370 0.176056 0.356985 0.201008 -0.043972 -0.050728 -0.045364 0.147294 -0.079766 -0.140251 -0.087487 0.220336 0.066890 -0.092855 -0.078161 -0.051596 -0.075607 -0.006611 -0.105525 -0.221565 0.142380
polarizability: 3.68416521e+02 1.38864361e+01 3.76477431e+02 9.17033322e+00 5.75480270e+00 1.42302845e+02
1716.lowfreq: -12.4276 -10.4850 -1.8856 -0.0006 -0.0005 0.0011 1.1980 11.5766 26.9597
frequency: -11.6371 11.0192 26.6932 33.3478 42.5668 59.9465 61.6868 74.5284 80.8357 89.5258 121.3561 153.6194 170.5609 174.3977 182.1414 185.6454 213.6416 219.6591 232.2659 248.1636 257.7367 264.0169 269.2511 280.1073 289.5871 330.6063 357.3401 367.8423 409.0893 435.4036 445.5256 463.5320 472.6873 483.2112 501.3525 512.4793 525.4626 533.1183 545.4448 586.0917 599.9968 631.7953 640.7870 663.1573 664.8911 676.2082 698.7787 707.7051 742.0643 744.9206 765.8878 780.4830 791.6582 807.4425 815.2052 845.5151 856.6762 859.8379 866.0720 878.9018 893.3948 894.3810 898.6485 908.3528 942.1574 943.1130 959.6763 961.2000 986.5445 990.4355 1017.8500 1025.2086 1031.1602 1037.6152 1050.3113 1065.6016 1085.0379 1090.2794 1108.4725 1133.8040 1171.2887 1187.1069 1192.6128 1213.7712 1216.8402 1222.7431 1239.1435 1247.8794 1269.3139 1271.5772 1279.8012 1282.6586 1283.2670 1332.6113 1349.9009 1373.1542 1376.0102 1384.9133 1386.2183 1390.1567 1401.5621 1433.7525 1448.9097 1449.8748 1451.3879 1459.6032 1461.2600 1461.8992 1474.3415 1476.0936 1476.8909 1484.2884 1485.7000 1490.3000 1497.7022 1502.3178 1544.5332 1550.2426 1577.5633 1616.3408 1638.2654 1674.9987 2971.1007 2973.1978 2977.0709 2978.0345 2984.9994 2988.2201 3027.5217 3058.9035 3059.0780 3065.1885 3070.0391 3074.5177 3083.6818 3086.7349 3093.3669 3093.9197 3119.2327 3133.2584 3150.0572 3167.5080 3187.6146 3190.4480 3204.0394 3259.4265 3581.1334
redmass: 2.9796 4.7634 2.9143 4.4574 5.3934 3.8012 3.5303 2.2920 3.9710 4.2699 2.4868 4.9322 3.6077 1.9244 4.3793 2.9250 1.1421 4.1330 1.1815 1.8953 2.5863 4.2159 1.5719 2.9700 3.3617 4.9796 2.5394 2.8488 2.8374 3.2073 5.1292 3.0001 2.0785 3.8262 4.6454 2.0393 5.3004 7.1920 4.0328 4.3126 7.2419 4.9753 4.9914 4.2994 6.3158 8.2837 1.3346 5.2180 2.3986 1.4754 1.4495 6.0699 2.6614 5.6618 3.4404 3.9211 2.5278 1.5279 1.4102 1.7371 1.4559 1.8238 1.6589 1.7091 1.2107 1.3651 1.3606 4.7546 3.9099 1.3205 1.4045 1.7586 2.0603 2.1101 2.6997 1.6996 1.5266 2.1273 2.0768 1.9493 1.3918 1.5800 1.8845 3.0093 2.9590 1.4945 3.1306 2.4845 1.9545 1.6165 1.4582 1.8708 1.5922 1.4714 2.6154 1.2072 1.1835 2.0732 2.0167 5.9544 1.2000 2.3582 1.1056 1.4065 2.5051 1.0968 1.0822 1.1053 1.0633 1.0470 1.0723 1.2014 1.0802 1.4667 1.9509 3.3632 6.9593 7.4737 5.0025 4.4256 3.1268 2.1335 1.0355 1.0366 1.0359 1.0598 1.0358 1.0618 1.0982 1.1010 1.0970 1.0967 1.0994 1.1021 1.1001 1.1007 1.0996 1.0999 1.0858 1.0896 1.0948 1.0992 1.0925 1.0832 1.0929 1.1014 1.0765
irintensity: 0.1277 0.0417 0.0008 0.0463 0.4085 0.9000 0.5138 0.1263 0.0937 0.2481 1.1276 3.0403 0.8702 3.1455 1.8172 1.6972 0.3091 1.7530 0.5639 5.8261 1.8031 1.9417 1.6991 0.2657 0.7224 2.1967 1.2199 0.9309 1.4550 1.4214 21.7895 0.5075 40.4791 0.9149 1.8236 58.7653 2.6321 14.8535 3.1699 17.4651 6.3639 2.2479 6.4982 2.7206 8.8609 6.4351 69.8947 2.8297 2.3003 8.0614 56.3149 1.2098 13.5093 20.0920 3.3117 1.6436 1.3827 40.4889 1.8394 7.1660 28.4997 3.4513 0.3177 0.5650 0.6273 15.4457 9.9662 12.5019 31.3601 0.0270 2.6837 2.9542 29.1858 18.6160 6.6740 4.3703 4.2938 31.6559 51.8416 83.8359 14.9086 75.1846 157.3429 28.6880 27.2892 4.7733 18.4277 147.1583 55.9339 51.0660 14.0290 34.7493 103.9623 5.6731 5.7207 13.7012 21.6646 44.7390 26.0610 46.5882 23.1051 114.2241 22.0051 99.6205 0.6809 0.3574 2.0943 2.5933 3.5859 11.9756 15.1020 35.3669 16.0077 7.0536 124.8831 18.3798 264.6042 123.8156 587.6302 41.7719 483.8086 418.6611 53.7888 18.7485 48.8651 7.5795 19.1112 53.7748 2.1186 1.9372 4.7253 99.5784 51.5870 84.7607 14.2064 2.5547 80.7098 42.0119 0.0729 9.9221 28.3795 31.3106 8.9741 469.1486 5.8600 3.0017 89.5271
temp: 298.150 k
press: 1.00000 atm
elementType: 16 7 7 7 7 7 6 6 6 6 6 6 6 6 6 6 6 6 6 6 6 6 6 6 6 6 1 1 1 1 1 1 1 1 1 1 1 1 1 1 1 1 1 1 1 1 1 1 1 1 1
symmnumber: 1
zpe: 1089079.1 jmol-1
zpe.correction: 0.414808 hartree
zpe.thermalcorrener: 0.440106 hartree
zpe.thermalcorrenthalpy: 0.441051 hartree
zpe.thermalcorrgfe: 0.357773 hartree
zpe.sumelectzpe: -1447.049751 hartree
zpe.sumelectthermal: -1447.024453 hartree
zpe.sumelectthermalent: -1447.023509 hartree
zpe.sumelectthermalfe: -1447.106786 hartree
dipole: 6.3261 -1.7426 0.5031
dipole: 6.5810
quadrupole: -154.6731 -142.2011 -169.4082
quadrupole: 6.5069 -0.2853 2.0535
quadrupole: 0.7544 13.2263 -13.9807 6.5069 -0.2853 2.0535
hfenergy: -1447.4645592 hartree
pointgroup: C01 [X(C20H25N5S1)]
dipole: 2.5535749 0.0765006 -0.4208823 debye
polarizability: 359.7368288|-11.0662915|382.5608862|-25.7374117|-1.9058366|144.899082 unknown
InChI: InChI=1S/C20H25N5S/c1-5-8-14-13-17(15-9-6-7-10-16(15)22-14)23-18(25-20(2,3)4)24-19-21-11-12-26-19/h6-7,9-13,23-24H,5,8H2,1-4H3
charge 0 multiplicity 1
51 atoms
S  5.217272 -1.405741 -0.643803
N  1.249044 1.928103 -0.003003
N  0.670283 -0.384378 0.035177
N  -3.577037 -0.30827 0.646279
N  2.941085 0.198381 -0.278666
N  2.685385 -2.204804 -0.29339
C  2.154878 3.10937 -0.119445
C  -0.722043 -0.323782 0.233771
C  -1.448229 -1.582596 0.315812
C  2.811441 3.202641 -1.530378
C  1.228787 4.340972 0.062745
C  3.230502 3.148683 1.009729
C  -2.863587 0.837264 0.564029
C  -3.641369 2.137384 0.65451
C  -1.447035 0.871912 0.359987
C  -2.880244 -1.505528 0.523244
C  1.578864 0.669812 -0.074791
C  -4.031666 2.683482 -0.748132
C  -0.839634 -2.875356 0.208058
C  -3.638925 -2.716539 0.613273
C  -4.843244 3.993224 -0.660817
C  -1.607836 -4.04097 0.299656
C  -3.01937 -3.963332 0.503858
C  3.415777 -1.093894 -0.375238
C  4.817649 -3.169215 -0.623312
C  3.465968 -3.359493 -0.431749
H  2.031075 3.154734 -2.310154
H  3.54086 2.396847 -1.739186
H  3.345729 4.164537 -1.632875
H  0.74092 4.303929 1.052472
H  0.437186 4.333668 -0.706652
H  1.798947 5.284556 -0.019685
H  2.748824 3.002916 1.992691
H  3.732249 4.133195 1.012598
H  4.024167 2.382991 0.908731
H  -4.562465 1.955113 1.23715
H  -3.043519 2.90409 1.185414
H  -0.912862 1.820512 0.303954
H  1.106128 -1.324414 -0.044948
H  -3.113225 2.848468 -1.346097
H  -4.619497 1.907994 -1.275816
H  0.240621 -2.975632 0.051719
H  -4.717265 -2.61537 0.770644
H  3.625097 0.94957 -0.351414
H  -4.263544 4.788685 -0.15487
H  -5.119657 4.362414 -1.665743
H  -5.776883 3.841804 -0.087222
H  -1.12405 -5.020566 0.214476
H  -3.611475 -4.882544 0.574197
H  5.607079 -3.904767 -0.75293
H  2.978246 -4.333062 -0.382059
