program: Orca
programVersion: 5.0.3
elementType: C H C H C C C H H C H H C C H H H H H H H
charge: 1
multiplicity: 1
keywords: m062x cc-pVTZ EnGrad RIJCOSX verytightscf cc-pVTZ/C def2/J soscf
formula: C8H13
InChI: InChI=1/C8H13/c1-2-4-6-8-7-5-3-1/h1-2,7H,3-6,8H2
21 atoms
C  -1.997386 0.633098 0.078384
H  -2.17525 0.784882 1.149393
C  -1.791649 -0.951739 -0.171659
H  -2.639151 -1.444766 0.313675
C  -0.421919 -1.339733 0.366924
C  0.663391 -1.256653 -0.420145
C  1.964673 -0.705427 0.070488
H  2.148346 -0.94005 1.124018
H  2.830545 -1.034251 -0.514189
C  1.810371 0.838374 -0.113581
H  1.846431 1.096727 -1.17787
H  2.630469 1.370857 0.375936
C  0.45862 1.381262 0.504642
C  -0.721027 1.226339 -0.329203
H  0.520294 -1.226092 -1.503616
H  -1.851876 -1.143267 -1.24724
H  0.297071 1.005271 1.517019
H  -0.632271 1.578248 -1.362092
H  -2.844491 0.988471 -0.514582
H  0.604797 2.481953 0.56129
H  -0.313342 -1.401873 1.45021
totalener: -312.28128626 hartree
nucrepener: 379.60934907 hartree
electener: -691.89063532 hartree
oneelecener: -1159.98069184 hartree
twoeener: 468.09005652 hartree
kineticenergy: 310.01574825 hartree
xcener: -23.082653752456 hartree
chargesum: 1.0000000
charge: -0.295973 0.214332 -0.285594 0.194801 -0.167135 -0.147042 -0.301329 0.186473 0.187107 -0.275893 0.181677 0.191466 -0.287370 0.101630 0.195872 0.194187 0.199287 0.272415 0.198996 0.232082 0.210012
charge: 0.103421 0.014965 0.111952 0.002538 0.052817 0.043526 0.068292 -0.001302 0.003729 0.113383 -0.007856 0.000741 0.078523 0.359475 -0.017492 0.000074 0.007146 0.024910 0.010589 0.050442 -0.019873
qa: -0.2960 0.2143 -0.2856 0.1948 -0.1671 -0.1470 -0.3013 0.1865 0.1871 -0.2759 0.1817 0.1915 -0.2874 0.1016 0.1959 0.1942 0.1993 0.2724 0.1990 0.2321 0.2100
va: 3.7241 0.9474 3.7751 0.9541 3.6353 3.6484 3.7770 0.9601 0.9596 3.7234 0.9557 0.9520 3.7499 3.2985 0.9537 0.9559 0.9600 0.9149 0.9606 0.9439 0.9517
energy: -312.281286255707
dipole: 0.39490 -1.00707 -0.61217 1.98111 -0.62195 1.35917 0.16094 -0.30569 -0.14475
magnitude: 1.49767 au
magnitude: 3.80679 debye
