program: Orca
programVersion: 5.0.3
elementType: C H C H C C C H H C H H C C H H H H H H H
charge: 1
multiplicity: 1
keywords: b3lyp def2-TZVP EnGrad RIJCOSX verytightscf def2/J soscf
formula: C8H13
InChI: InChI=1/C8H13/c1-2-4-6-8-7-5-3-1/h1-2,7H,3-6,8H2
21 atoms
C  -1.992303 0.548591 0.113374
H  -2.167837 0.734616 1.17706
C  -1.901636 -0.981158 -0.174652
H  -2.669054 -1.552504 0.35264
C  -0.484799 -1.221513 0.309166
C  0.625943 -1.178411 -0.480611
C  1.917161 -0.672312 0.071091
H  2.041494 -0.949415 1.123304
H  2.783432 -1.040097 -0.486998
C  1.859431 0.886214 -0.063535
H  1.940037 1.160633 -1.122191
H  2.710642 1.342622 0.449289
C  0.53169 1.471895 0.505114
C  -0.604464 0.981607 -0.294184
H  0.532996 -1.308067 -1.558916
H  -1.988962 -1.178991 -1.247648
H  0.401096 1.275965 1.573473
H  -0.470826 1.087683 -1.374388
H  -2.766648 1.05289 -0.47596
H  0.585892 2.568302 0.372129
H  -0.343072 -1.189409 1.391098
totalener: -312.24437017 hartree
nucrepener: 382.83622666 hartree
electener: -695.08059683 hartree
oneelecener: -1166.66342007 hartree
twoeener: 471.58282324 hartree
kineticenergy: 310.53470674 hartree
exchangeener: -36.331849754252 hartree
correlationener: -2.306150320651 hartree
xcener: -38.638000074903 hartree
chargesum: 1.0000000
charge: -0.186756 0.155568 -0.190519 0.165771 -0.071742 -0.072613 -0.208907 0.148960 0.161990 -0.217958 0.144459 0.163106 -0.150698 -0.004197 0.173138 0.150567 0.146400 0.184471 0.167943 0.183198 0.157820
charge: -0.200767 0.157006 -0.195073 0.152264 -0.063597 -0.077870 -0.213002 0.154977 0.160223 -0.202776 0.149192 0.153662 -0.220573 0.089833 0.160847 0.154692 0.156543 0.170361 0.160110 0.190509 0.163439
qa: -0.1868 0.1556 -0.1905 0.1658 -0.0717 -0.0726 -0.2089 0.1490 0.1620 -0.2180 0.1445 0.1631 -0.1507 -0.0042 0.1731 0.1506 0.1464 0.1845 0.1679 0.1832 0.1578
va: 3.8496 0.9712 3.8362 0.9707 3.8148 3.8057 3.8868 0.9687 0.9699 3.8487 0.9687 0.9648 3.8653 3.6504 0.9600 0.9733 0.9739 0.9520 0.9690 0.9606 0.9658
energy: -312.244370168381
dipole: 0.55213 -0.81989 -0.26775 1.87614 -1.37597 0.50017 0.16184 -0.28995 -0.12811
magnitude: 0.58161 au
magnitude: 1.47833 debye
