program: Orca
programVersion: 5.0.3
elementType: C H C H C C C H H C H H C C H H H H H H H
charge: 1
multiplicity: 1
keywords: DSD-PBEP86 def2-TZVP D3BJ RIJCOSX verytightscf def2-TZVP/C def2/J soscf noTRAH
formula: C8H13
InChI: InChI=1/C8H13/c1-2-4-6-8-7-5-3-1/h1-2,7H,3-6,8H2
21 atoms
C  -1.990054 0.575349 0.095461
H  -2.166869 0.75438 1.161619
C  -1.848632 -0.965627 -0.173966
H  -2.656941 -1.508096 0.324161
C  -0.45304 -1.285713 0.340046
C  0.642879 -1.223973 -0.451261
C  1.935482 -0.690686 0.072676
H  2.089711 -0.945078 1.126489
H  2.804098 -1.036618 -0.497383
C  1.83277 0.860538 -0.091529
H  1.883283 1.122486 -1.154874
H  2.673758 1.356827 0.401119
C  0.498557 1.438219 0.511517
C  -0.662231 1.121962 -0.315809
H  0.527869 -1.283846 -1.534836
H  -1.913412 -1.162243 -1.24905
H  0.355978 1.150183 1.556143
H  -0.554564 1.365128 -1.377673
H  -2.806075 1.008187 -0.493693
H  0.620811 2.539222 0.470826
H  -0.324589 -1.298607 1.423709
totalener: -311.13162331 hartree
nucrepener: 380.83062966 hartree
electener: -691.96225296 hartree
oneelecener: -1162.06492500 hartree
twoeener: 470.10267204 hartree
kineticenergy: 310.01144270 hartree
exchangeener: -13.668346623076 hartree
correlationener: -0.922522407540 hartree
xcener: -14.590869030616 hartree
chargesum: 1.0000000
charge: -0.204276 0.172926 -0.208036 0.176440 -0.151288 -0.140073 -0.217117 0.155885 0.166974 -0.242898 0.150530 0.173784 -0.172707 0.088918 0.167090 0.164456 0.161528 0.209851 0.181552 0.201135 0.165327
charge: -0.195171 0.160865 -0.193133 0.150752 -0.105035 -0.125024 -0.219143 0.150625 0.154038 -0.196601 0.144744 0.150409 -0.214240 0.189228 0.154923 0.152674 0.157641 0.174514 0.160611 0.192747 0.154578
qa: -0.2043 0.1729 -0.2080 0.1764 -0.1513 -0.1401 -0.2171 0.1559 0.1670 -0.2429 0.1505 0.1738 -0.1727 0.0889 0.1671 0.1645 0.1615 0.2099 0.1816 0.2011 0.1653
va: 3.8418 0.9678 3.8544 0.9690 3.8706 3.8540 3.8958 0.9720 0.9711 3.8723 0.9711 0.9632 3.8670 3.5262 0.9633 0.9729 0.9758 0.9402 0.9682 0.9570 0.9642
total: -311.801986527 hartree
dispcorr: -0.011912966 hartree
energy: -311.813899493159
dipole: 0.49948 -1.01972 -0.52025 1.93027 -0.83901 1.09126 0.14651 -0.32124 -0.17473
magnitude: 1.22149 au
magnitude: 3.10478 debye
