program: Orca
programVersion: 5.0.3
elementType: C H C H C C C H H C H H C C H H H H H H H
charge: 1
multiplicity: 1
keywords: PBE0 def2-TZVP EnGrad RIJCOSX verytightscf def2/J soscf
formula: C8H13
InChI: InChI=1/C8H13/c1-2-4-6-8-7-5-3-1/h1-2,7H,3-6,8H2
21 atoms
C  -1.990333 0.560033 0.105409
H  -2.166334 0.743144 1.170146
C  -1.875464 -0.97388 -0.174825
H  -2.663864 -1.531547 0.337143
C  -0.469031 -1.255405 0.324406
C  0.633814 -1.202255 -0.466689
C  1.924825 -0.681544 0.0723
H  2.06341 -0.947232 1.12561
H  2.793175 -1.0383 -0.490606
C  1.845351 0.873335 -0.0776
H  1.909182 1.1409 -1.139059
H  2.693128 1.349646 0.422972
C  0.516384 1.45829 0.509859
C  -0.632681 1.054189 -0.306207
H  0.530865 -1.300428 -1.547927
H  -1.950722 -1.170772 -1.249092
H  0.379964 1.218351 1.567944
H  -0.509309 1.221546 -1.38049
H  -2.786879 1.02946 -0.48322
H  0.607816 2.558179 0.421456
H  -0.333193 -1.243097 1.407416
totalener: -312.06666620 hartree
nucrepener: 381.74697933 hartree
electener: -693.81364554 hartree
oneelecener: -1164.50064393 hartree
twoeener: 470.68699839 hartree
kineticenergy: 310.15931666 hartree
exchangeener: -34.174355244488 hartree
correlationener: -1.965800111956 hartree
xcener: -36.140155356444 hartree
chargesum: 1.0000000
charge: -0.193352 0.168057 -0.207049 0.175631 -0.108178 -0.101246 -0.221397 0.160545 0.173274 -0.247752 0.158339 0.176643 -0.159611 -0.011478 0.172614 0.163818 0.159286 0.197226 0.179668 0.200047 0.164916
charge: -0.207914 0.162819 -0.202871 0.155688 -0.077807 -0.101544 -0.222608 0.158219 0.163752 -0.206455 0.152894 0.157196 -0.225658 0.110266 0.162625 0.158720 0.161522 0.173777 0.165315 0.198605 0.163461
qa: -0.1934 0.1681 -0.2070 0.1756 -0.1082 -0.1012 -0.2214 0.1605 0.1733 -0.2478 0.1583 0.1766 -0.1596 -0.0115 0.1726 0.1638 0.1593 0.1972 0.1797 0.2000 0.1649
va: 3.9038 0.9708 3.8973 0.9695 3.9388 3.9177 3.9511 0.9695 0.9694 3.9429 0.9687 0.9624 3.9286 3.7765 0.9610 0.9735 0.9738 0.9465 0.9681 0.9578 0.9635
energy: -312.066666203396
dipole: 0.53154 -0.84995 -0.31841 1.90018 -1.19714 0.70304 0.15189 -0.27608 -0.12419
magnitude: 0.78171 au
magnitude: 1.98695 debye
