program: Gaussian 09
title: 000051253
version: EM64L-G09RevD.01
frameworkgroup: C1[X(C25H30N2)]
method: RPBEPBE
basis: SDD
operation: Freq
keyword: #pfreq=noraman
keyword: PBEPBE/SDD
title: #p freq=noraman PBEPBE/SDD
converged: YES YES NO NO
title: Mulliken charges:
elementType: N N C C C C C C C C C C C C C C C C C C C C C C C C C H H H H H H H H H H H H H H H H H H H H H H H H H H H H H H
charge: -0.186203 -0.237675 -0.193647 -0.361880 0.483071 -0.451850 -0.427563 0.367962 0.379647 -0.452430 -0.414210 -0.444213 -0.468988 -0.382861 -0.389823 -0.399008 0.140754 0.150936 -0.407191 -0.416228 -0.370053 -0.368858 -0.689561 -0.275140 -0.277023 -0.256459 -0.252199 0.225266 0.265771 0.222395 0.218356 0.197091 0.199513 0.210859 0.200891 0.210594 0.219272 0.207763 0.209395 0.228729 0.209659 0.196495 0.195650 0.218913 0.186068 0.218465 0.264904 0.222361 0.236942 0.237393 0.240896 0.228268 0.239327 0.223394 0.223456 0.220700 0.221909
chargesum: 0.00000
title: Mulliken charges with hydrogens summed into heavy atoms:
elementType: N N C C C C C C C C C C C C C C C C C C C C C C C C C
charge: -0.186203 -0.237675 0.031619 -0.096109 0.483071 -0.011099 -0.030960 0.367962 0.379647 -0.040680 -0.203616 -0.017179 -0.030864 0.023292 0.024740 0.005525 0.140754 0.150936 -0.142287 -0.193868 -0.133111 -0.131465 0.018930 -0.051746 -0.053567 -0.035759 -0.030290
polarizability: 3.15239824e+02 -1.20052168e+01 3.24372231e+02 -2.12394889e+01 2.34568736e+00 2.04344602e+02
1716.lowfreq: -5.8365 -2.2515 -0.0005 -0.0003 -0.0003 9.5515 29.0034 35.8441 47.5781
frequency: 28.7370 35.8368 47.5643 54.1941 75.3423 86.2742 93.2189 111.7231 128.8326 133.6011 162.2923 192.6116 207.5338 219.1928 242.3252 263.4045 271.7448 297.8682 322.2733 325.4150 357.8010 361.9746 381.9462 400.6226 420.0131 421.7326 439.7487 449.9585 459.3521 468.2781 493.6378 517.3117 524.7316 528.5996 554.0009 572.3238 578.1882 582.8959 611.2359 644.9886 666.6629 699.9451 719.9570 744.4076 750.0584 755.1955 768.1866 789.4244 791.9734 802.2840 817.4002 832.8428 844.9762 845.8828 848.4097 850.4202 872.8955 877.5372 887.4102 909.6789 912.0199 929.7671 941.0066 948.1047 966.3580 973.4369 981.1684 994.2618 1001.6900 1028.0647 1041.7610 1044.2767 1058.6968 1061.4405 1076.3844 1084.7758 1095.0759 1099.3024 1110.8872 1113.9107 1125.7279 1129.1819 1137.4415 1150.4460 1151.3884 1173.5043 1176.9131 1179.6638 1187.9794 1201.9826 1206.6431 1217.7185 1223.0189 1240.0573 1249.5992 1259.9641 1272.2534 1274.7147 1282.7776 1308.8354 1312.2266 1325.2103 1328.1603 1331.5051 1333.4073 1335.4996 1341.5998 1344.7515 1345.9681 1350.1352 1355.2572 1358.0288 1381.1014 1389.0731 1390.2151 1435.9941 1448.4397 1451.9422 1452.1743 1459.9484 1461.0903 1466.2545 1466.3703 1467.6638 1473.9075 1477.0575 1480.6444 1488.2377 1493.5355 1505.7348 1578.6512 1599.2793 1602.2252 1620.9558 1638.9231 2934.3192 2936.7031 2946.9429 2951.1850 2958.6261 2961.5080 2973.7240 2976.6027 2984.2142 2987.0995 3004.6463 3013.6189 3028.8305 3033.3341 3038.4835 3048.5959 3049.8632 3052.2578 3056.1165 3075.6317 3095.6409 3109.5136 3123.5381 3123.8510 3129.2707 3136.3191 3152.2642 3152.7788 3164.8379 3166.5403
redmass: 4.2613 3.5950 3.8619 3.6448 3.2917 4.1395 3.7013 4.3316 3.4202 3.1226 3.0965 2.7572 1.3188 3.4785 4.2759 2.0801 3.9991 1.9218 2.5839 3.6884 4.5713 2.7587 2.0463 3.8802 2.7254 4.4264 2.5161 3.0866 3.2265 2.9905 3.0858 4.0465 3.3064 4.0393 2.5907 3.2763 3.4480 2.7654 6.1455 4.9951 3.5321 5.0861 3.1533 2.7030 1.4756 1.4527 2.9037 2.5652 1.6321 1.4976 2.9883 2.5328 1.7468 1.5279 2.2143 1.4434 2.2320 2.7242 2.8092 2.4523 2.3108 1.4658 1.3910 1.3631 1.3056 1.3284 2.4520 2.9256 2.5125 2.2637 2.7123 2.2294 2.5709 2.6178 1.4896 2.1709 2.2156 2.4183 1.5562 1.3105 1.7540 1.6518 1.4564 1.4120 1.2689 1.1688 1.1238 1.4961 2.1151 1.9814 1.6034 1.7526 1.4635 1.3368 1.2684 1.3150 1.8514 1.3426 1.2180 1.8941 1.5128 1.8297 1.2969 2.0530 1.4321 1.4398 1.5180 1.7567 1.5327 1.3756 1.4389 1.4144 1.8449 8.3918 4.5036 1.5842 1.5835 1.1126 2.3246 1.0968 1.0876 1.0876 1.0839 1.0935 1.1391 1.0966 2.2587 1.2141 1.1847 2.0148 6.5737 7.5067 6.4453 6.6146 6.8449 1.0811 1.0664 1.0467 1.0681 1.0695 1.0635 1.0616 1.0606 1.0610 1.0609 1.0911 1.0828 1.0966 1.1009 1.1024 1.0987 1.1028 1.0865 1.0990 1.0933 1.1004 1.0876 1.0889 1.0849 1.0874 1.0899 1.0935 1.0937 1.0990 1.0985
irintensity: 0.0909 0.1505 0.1669 0.1237 0.8610 0.9271 0.6339 0.2208 0.1190 2.6515 0.0511 2.7677 0.0115 1.9252 0.3472 0.4673 0.3450 2.1702 1.0396 0.3767 3.4066 2.5377 0.4809 4.1664 0.9414 1.1438 1.5335 4.7245 0.3836 0.4445 2.3721 7.6753 6.7504 0.2291 8.9321 8.4088 0.9895 1.6076 1.9877 9.7207 9.6582 3.9126 4.5212 1.5431 31.0421 127.8242 4.3998 4.1302 21.9119 2.1076 0.5579 0.8963 29.5072 2.6124 1.7825 0.9661 20.4426 2.7223 10.7376 1.9759 12.2654 2.4705 1.3216 6.3710 0.1223 0.6079 1.6487 15.0315 4.5521 20.5905 7.8757 25.9467 7.0467 2.3574 3.2795 8.4688 1.8341 1.5991 5.6700 6.8528 9.5791 32.5149 15.1393 5.5133 2.6588 3.2141 5.0198 6.8375 49.1067 10.8313 6.5584 7.0223 16.0987 4.6469 1.8858 1.8988 11.5108 14.0762 11.1188 23.5718 6.2793 22.1302 6.4101 64.3888 5.3361 13.7511 6.1737 64.1865 20.6412 5.6355 2.4270 1.9386 43.6332 9.0155 0.2266 3.8841 10.5197 9.7186 19.2860 7.0012 12.8404 7.0960 7.5825 15.0352 20.5266 10.8234 196.8756 46.7501 101.3786 1.9631 1.4376 17.1699 81.6679 21.1211 57.3734 26.4546 57.6495 91.7130 37.6060 48.8541 52.0759 33.4722 31.7599 40.2347 22.4753 68.3645 13.2215 76.9991 45.9823 40.9430 48.4617 39.4639 27.2138 46.7719 36.3817 15.6146 15.4684 35.8145 4.1447 11.7099 9.4596 20.4239 36.3139 33.1007 22.0333
temp: 298.150 k
press: 1.00000 atm
elementType: 7 7 6 6 6 6 6 6 6 6 6 6 6 6 6 6 6 6 6 6 6 6 6 6 6 6 6 1 1 1 1 1 1 1 1 1 1 1 1 1 1 1 1 1 1 1 1 1 1 1 1 1 1 1 1 1 1
symmnumber: 1
zpe: 1288468.4 jmol-1
zpe.correction: 0.490752 hartree
zpe.thermalcorrener: 0.513911 hartree
zpe.thermalcorrenthalpy: 0.514855 hartree
zpe.thermalcorrgfe: 0.438881 hartree
zpe.sumelectzpe: -1078.178480 hartree
zpe.sumelectthermal: -1078.155321 hartree
zpe.sumelectthermalent: -1078.154377 hartree
zpe.sumelectthermalfe: -1078.230351 hartree
dipole: 0.4192 0.2800 0.5856
dipole: 0.7727
quadrupole: -140.3210 -156.0584 -165.9322
quadrupole: 4.2252 -9.1504 -0.7109
quadrupole: 13.7829 -1.9545 -11.8284 4.2252 -9.1504 -0.7109
hfenergy: -1078.6692322 hartree
pointgroup: C01 [X(C25H30N2)]
dipole: -0.1387451 -0.1559501 0.2210116 debye
polarizability: 320.2647691|-14.436855|319.320247|15.6288637|13.1075503|204.371642 unknown
InChI: InChI=1S/C25H30N2/c1-26-22-14-6-3-11-19(22)25(20-12-4-7-15-23(20)26)21-13-5-8-16-24(21)27-17-9-2-10-18-27/h3-4,6-7,11-12,14-16,21,25H,2,5,8-10,13,17-18H2,1H3
charge 0 multiplicity 1
57 atoms
N  -2.577882 -0.333797 -0.537973
N  3.030076 0.833723 0.056685
C  -0.433276 -0.524595 0.763552
C  0.39708 -0.23066 -0.569328
C  -1.878947 -0.001896 0.668864
C  0.317481 -0.00117 2.018441
C  -0.594174 0.145694 3.252297
C  0.738717 1.243324 -0.752355
C  1.654136 -1.091291 -0.613941
C  -1.707236 1.165779 2.931656
C  -2.42618 0.784865 1.651179
C  -2.58475 -1.743147 -1.014741
C  -3.864887 0.329328 -0.850047
C  -3.75012 -2.561269 -0.398367
C  -5.096793 -0.404605 -0.251724
C  -5.107452 -1.884978 -0.708739
C  2.034391 1.737444 -0.405862
C  2.924097 -0.547653 -0.249458
C  -0.227192 2.147002 -1.246943
C  1.574766 -2.454705 -0.971962
C  2.315528 3.124417 -0.552921
C  4.065732 -1.398055 -0.227624
C  4.261813 1.352904 0.662043
C  0.046286 3.526663 -1.380806
C  2.703667 -3.303796 -0.943024
C  1.324589 4.01037 -1.025587
C  3.951088 -2.764308 -0.558847
H  -0.466575 -1.633981 0.841195
H  -0.266445 -0.526534 -1.40238
H  0.743363 0.994921 1.793282
H  1.168833 -0.675049 2.22992
H  0.001696 0.477221 4.125065
H  -1.051446 -0.829385 3.514458
H  -1.263537 2.182905 2.858927
H  -2.441445 1.210205 3.760557
H  -3.462319 1.130575 1.556125
H  -1.620758 -2.225475 -0.786845
H  -2.697422 -1.731265 -2.119875
H  -3.971491 0.337881 -1.956023
H  -3.818237 1.380315 -0.515662
H  -3.605426 -2.626425 0.698376
H  -3.730517 -3.594544 -0.79779
H  -6.025041 0.107289 -0.573345
H  -5.059824 -0.360182 0.853353
H  -5.291515 -1.928104 -1.80331
H  -5.936382 -2.434174 -0.223263
H  -1.21244 1.747638 -1.512332
H  0.600681 -2.860432 -1.275126
H  3.31278 3.515505 -0.332012
H  5.052873 -0.995384 0.016066
H  4.03379 2.263332 1.240145
H  5.045115 1.597857 -0.085925
H  4.670317 0.608107 1.364803
H  -0.722919 4.209777 -1.75639
H  2.613113 -4.359408 -1.219499
H  1.562417 5.075189 -1.131154
H  4.844104 -3.399363 -0.536009
