program: Gaussian 09
title: 000051210
version: EM64L-G09RevD.01
frameworkgroup: C1[X(C19H21FN2OS)]
method: RPBEPBE
basis: SDD
operation: Freq
keyword: #p
keyword: freq=noraman
keyword: PBEPBE/SDD
title: #p freq=noraman PBEPBE/SDD
converged: YES YES NO NO
title: Mulliken charges:
elementType: S F O N N C C C C C C C C C C C C C C C C C C C H H H H H H H H H H H H H H H H H H H H H
charge: 0.174679 -0.208695 -0.433846 -0.102259 -0.060061 -0.166389 -0.355249 -0.346918 -0.395184 -0.398692 -0.637306 0.624508 0.658194 -0.397364 -0.614174 -0.604513 -0.310103 -0.397282 -0.219347 0.307664 -0.441793 -0.414573 -0.403233 0.334045 0.200544 0.187717 0.222098 0.224834 0.189037 0.194477 0.203942 0.203785 0.195214 0.231966 0.252502 0.221445 0.221293 0.188579 0.267570 0.234257 0.253157 0.274516 0.226966 0.256311 0.357680
chargesum: 0.00000
title: Mulliken charges with hydrogens summed into heavy atoms:
elementType: S F O N N C C C C C C C C C C C C C C C C C C C
charge: 0.174679 -0.208695 -0.076166 -0.102259 -0.060061 0.034155 0.054566 0.066954 0.003235 0.000308 -0.152838 0.624508 0.658194 -0.397364 0.017143 -0.336943 -0.310103 -0.163025 0.033810 0.307664 -0.167277 -0.187607 -0.146922 0.334045
polarizability: 3.26790958e+02 9.61058329e+00 1.91259779e+02 -8.05871086e+00 1.59735678e+01 2.03750657e+02
1716.lowfreq: -9.1127 -0.0019 -0.0012 -0.0012 1.2758 11.1356 20.1171 30.5341 53.0440
frequency: 19.8054 30.4454 52.7472 58.5491 81.0941 93.2420 119.4176 159.6056 171.6593 193.0665 201.0572 212.9913 218.4420 233.4901 260.7876 270.7276 289.7850 314.8478 320.2363 334.8049 353.8968 357.3368 372.7073 391.9672 409.6974 413.7144 432.8140 443.4650 449.9684 471.1671 482.7761 498.0874 559.2748 570.9296 606.0259 618.4657 637.6130 662.7678 670.6749 691.9528 711.9261 740.3615 749.7230 761.8859 799.3936 802.9708 832.7673 850.1482 861.2898 873.1298 894.3882 899.0603 929.0946 932.3513 934.3807 956.2235 1002.1253 1011.0950 1029.9834 1041.2415 1048.8864 1050.0819 1076.8098 1081.2951 1120.0660 1128.3828 1134.6199 1139.1019 1147.2173 1149.6604 1150.9161 1170.8287 1172.2409 1197.6386 1208.2140 1213.8644 1221.8864 1246.2512 1255.9281 1269.5196 1274.7849 1287.6638 1290.2994 1308.1068 1337.1485 1344.0414 1348.1341 1358.2494 1375.3999 1375.9799 1383.6948 1390.8279 1394.9739 1428.7299 1440.0799 1451.3586 1451.9362 1459.1495 1463.1278 1466.0968 1470.9474 1474.2620 1481.6694 1484.3361 1582.1162 1587.0970 1602.1827 1619.5614 2808.3935 2845.2672 2849.5671 2858.7879 2862.7155 2875.4653 2985.1768 3015.7044 3023.9900 3028.5271 3034.0236 3055.3710 3058.6218 3073.8069 3123.4960 3125.1097 3149.4915 3153.8633 3159.0730 3180.5827 3583.4608
redmass: 6.9281 6.1358 2.8444 4.4435 4.5810 5.2192 4.9540 6.3383 5.9843 3.5174 4.6537 4.3966 1.2519 3.5047 2.3204 4.2812 2.8259 6.2419 2.3855 3.6187 2.8688 1.1295 7.4483 2.2225 5.1345 4.5758 5.0079 3.0590 4.6271 4.5818 2.9413 3.8104 4.5707 3.3063 6.5419 2.8295 4.6072 5.5823 4.3907 3.8964 4.4779 4.5811 3.6677 3.1450 1.4307 1.4205 4.5850 1.5389 1.5391 4.9586 1.6587 3.0499 2.0405 1.4471 1.4858 2.0665 2.9176 2.4677 4.2170 2.8472 1.7444 2.2909 1.6991 1.7001 1.8596 1.6429 1.4355 2.1507 1.3275 3.0961 2.9948 1.5400 2.0821 1.0984 4.2250 1.3096 2.0214 1.4628 1.6829 2.3033 1.3396 1.5164 1.4489 1.2604 1.5281 1.2958 1.9064 1.5548 1.5150 4.3199 2.2166 1.8343 2.3631 1.1693 3.0970 1.0807 1.0788 1.0721 1.3286 1.2022 2.0002 1.1165 1.0564 2.0974 7.0825 8.0214 6.7636 6.3907 1.0805 1.0695 1.0626 1.0695 1.0679 1.0670 1.0623 1.0727 1.0885 1.0907 1.0989 1.0864 1.0888 1.1009 1.0889 1.0897 1.0921 1.0954 1.0922 1.0955 1.0661
irintensity: 0.0669 0.5690 0.1404 0.1561 0.2547 1.7761 1.5847 1.0714 0.5837 0.6341 0.1795 1.8384 0.2719 2.0557 2.4182 3.0336 0.6749 1.9799 7.7809 1.2641 4.7432 134.3389 6.3303 1.5504 1.8583 2.5966 12.0203 5.7791 0.8816 2.9689 0.9164 5.7437 2.1168 9.1602 7.6315 1.3718 1.8496 14.1301 4.7932 7.6257 6.7403 0.2468 6.0761 9.5741 52.3273 37.4830 30.0500 0.1790 36.6538 67.4031 40.4441 18.8475 8.1252 3.1095 5.7017 12.1699 17.1815 34.4123 12.1049 0.6054 0.7957 10.3457 6.2620 2.7609 20.7092 49.6550 20.5517 20.4745 142.6184 49.4120 43.5704 29.5941 51.6228 1.1814 20.6396 5.3748 4.0744 10.8552 8.8867 76.4772 0.0614 27.4933 31.6470 4.5691 18.6343 2.2288 2.4001 3.1811 3.9896 4.0941 1.9751 1.5727 16.3363 1.3446 2.3762 4.0121 0.7467 33.3156 101.6861 13.2822 46.3003 17.1903 5.3430 112.4638 39.5177 26.6516 94.9826 51.9564 68.5208 69.5264 70.1456 28.5940 19.3250 278.4757 22.3203 49.7963 46.6905 55.7394 18.4305 42.2683 12.2530 33.4021 18.0991 11.8331 5.0242 6.7959 0.5202 3.1632 55.4339
temp: 298.150 k
press: 1.00000 atm
elementType: 16 9 8 7 7 6 6 6 6 6 6 6 6 6 6 6 6 6 6 6 6 6 6 6 1 1 1 1 1 1 1 1 1 1 1 1 1 1 1 1 1 1 1 1 1
symmnumber: 1
zpe: 946913.1 jmol-1
zpe.correction: 0.360660 hartree
zpe.thermalcorrener: 0.382119 hartree
zpe.thermalcorrenthalpy: 0.383063 hartree
zpe.thermalcorrgfe: 0.310151 hartree
zpe.sumelectzpe: -1417.453825 hartree
zpe.sumelectthermal: -1417.432366 hartree
zpe.sumelectthermalent: -1417.431422 hartree
zpe.sumelectthermalfe: -1417.504334 hartree
dipole: 3.0001 0.3104 0.8035
dipole: 3.1213
quadrupole: -138.8839 -152.6149 -141.6288
quadrupole: -16.1750 -14.1717 -2.1809
quadrupole: 5.4920 -8.2390 2.7470 -16.1750 -14.1717 -2.1809
hfenergy: -1417.8144855 hartree
pointgroup: C01 [X(C19H21F1N2O1S1)]
dipole: -0.6381402 -0.9796327 -0.3756654 debye
polarizability: 227.2510816|61.7157012|289.9942289|13.149183|-9.0975197|204.5560836 unknown
InChI: InChI=1S/C19H21FN2OS/c1-21-6-8-22(9-7-21)17-10-13-2-3-14(20)11-19(13)24-18-5-4-15(23)12-16(17)18/h2-5,11-12,17,23H,6-10H2,1H3
charge 0 multiplicity 1
45 atoms
S  0.884951 -0.635012 1.705304
F  4.530836 2.889531 1.299427
O  -2.135458 -5.173883 -0.923969
N  -1.279415 0.672259 -0.440425
N  -3.157859 2.785655 0.234809
C  -0.721708 -0.471296 -1.208719
C  -1.374959 1.910918 -1.254506
C  -2.593011 0.37202 0.185733
C  -1.850816 3.090095 -0.390545
C  -3.054004 1.553856 1.051917
C  0.718121 -0.17469 -1.74382
C  -0.718751 -1.780489 -0.420515
C  1.673059 0.607257 -0.846617
C  0.031545 -1.965813 0.772499
C  -3.697349 3.927055 0.996958
C  -1.41585 -2.886476 -0.95505
C  1.838677 0.438941 0.557331
C  2.507403 1.563663 -1.490602
C  0.052825 -3.229461 1.408964
C  -1.40007 -4.14417 -0.312872
C  2.798878 1.208493 1.267921
C  -0.665605 -4.322328 0.881573
C  3.466568 2.339432 -0.809323
C  3.582298 2.137144 0.574617
H  -1.348585 -0.664306 -2.120672
H  -2.085469 1.775885 -2.110508
H  -0.380225 2.159195 -1.662428
H  -2.491398 -0.523996 0.821533
H  -3.37522 0.163388 -0.587533
H  -1.06538 3.30492 0.378919
H  -1.960622 3.987875 -1.028065
H  -4.048523 1.327118 1.480294
H  -2.32955 1.679561 1.896829
H  0.63117 0.380564 -2.695822
H  1.166868 -1.152087 -2.009637
H  -4.69444 3.668709 1.397151
H  -3.813084 4.799538 0.328592
H  -3.048648 4.23444 1.856921
H  -1.992467 -2.778754 -1.879422
H  2.393967 1.701517 -2.572659
H  0.645007 -3.361353 2.320479
H  2.941739 1.079549 2.34535
H  -0.636286 -5.295198 1.388069
H  4.096498 3.070275 -1.322815
H  -2.067955 -6.013737 -0.405565
