program: Orca
programVersion: 5.0.3
elementType: C H C H C C C H H C H H C C H H H H H H H
charge: 1
multiplicity: 1
keywords: PBE0 def2-TZVP EnGrad RIJCOSX verytightscf def2/J soscf
formula: C8H13
InChI: InChI=1/C8H13/c1-2-4-6-8-7-5-3-1/h1-2,7H,3-6,8H2
21 atoms
C  -1.990054 0.575349 0.095461
H  -2.166869 0.75438 1.161619
C  -1.848632 -0.965627 -0.173966
H  -2.656941 -1.508096 0.324161
C  -0.45304 -1.285713 0.340046
C  0.642879 -1.223973 -0.451261
C  1.935482 -0.690686 0.072676
H  2.089711 -0.945078 1.126489
H  2.804098 -1.036618 -0.497383
C  1.83277 0.860538 -0.091529
H  1.883283 1.122486 -1.154874
H  2.673758 1.356827 0.401119
C  0.498557 1.438219 0.511517
C  -0.662231 1.121962 -0.315809
H  0.527869 -1.283846 -1.534836
H  -1.913412 -1.162243 -1.24905
H  0.355978 1.150183 1.556143
H  -0.554564 1.365128 -1.377673
H  -2.806075 1.008187 -0.493693
H  0.620811 2.539222 0.470826
H  -0.324589 -1.298607 1.423709
totalener: -312.06050153 hartree
nucrepener: 380.83062966 hartree
electener: -692.89113119 hartree
oneelecener: -1162.69319880 hartree
twoeener: 469.80206761 hartree
kineticenergy: 310.15854546 hartree
exchangeener: -34.171816525567 hartree
correlationener: -1.963919259344 hartree
xcener: -36.135735784911 hartree
chargesum: 1.0000000
charge: -0.191822 0.171325 -0.210213 0.175358 -0.129279 -0.108300 -0.219975 0.160698 0.172157 -0.250899 0.159070 0.176547 -0.150868 0.008479 0.164683 0.165636 0.160755 0.200219 0.180291 0.202732 0.163406
charge: -0.205815 0.165946 -0.201398 0.155942 -0.091861 -0.118096 -0.224024 0.157575 0.163634 -0.202289 0.152453 0.157223 -0.221985 0.127329 0.161200 0.158793 0.162590 0.174137 0.166346 0.202154 0.160146
qa: -0.1918 0.1713 -0.2102 0.1754 -0.1293 -0.1083 -0.2200 0.1607 0.1722 -0.2509 0.1591 0.1765 -0.1509 0.0085 0.1647 0.1656 0.1608 0.2002 0.1803 0.2027 0.1634
va: 3.8983 0.9690 3.8966 0.9688 3.9459 3.9126 3.9469 0.9697 0.9697 3.9471 0.9681 0.9621 3.9123 3.7442 0.9633 0.9727 0.9754 0.9453 0.9677 0.9562 0.9637
energy: -312.060501529457
dipole: 0.49948 -0.87290 -0.37342 1.93027 -1.03141 0.89886 0.14651 -0.26957 -0.12306
magnitude: 0.98109 au
magnitude: 2.49373 debye
