program: Orca
programVersion: 5.0.3
elementType: C H C H C C C H H C H H C C H H H H H H H
charge: 1
multiplicity: 1
keywords: b3lyp cc-pVTZ EnGrad RIJCOSX verytightscf cc-pVTZ/C def2/J soscf
formula: C8H13
InChI: InChI=1/C8H13/c1-2-4-6-8-7-5-3-1/h1-2,7H,3-6,8H2
21 atoms
C  -2.003064 0.717775 0.071387
H  -2.174614 0.798199 1.148344
C  -1.743427 -0.971979 -0.170372
H  -2.624668 -1.367708 0.340762
C  -0.410137 -1.376437 0.381533
C  0.675976 -1.268087 -0.397405
C  1.988141 -0.706012 0.065088
H  2.185888 -0.925854 1.119527
H  2.848397 -1.038551 -0.523524
C  1.792952 0.831873 -0.126103
H  1.826058 1.0947 -1.189341
H  2.60088 1.380063 0.365849
C  0.434015 1.324341 0.49863
C  -0.758601 1.278003 -0.344061
H  0.514959 -1.189285 -1.477139
H  -1.829795 -1.140026 -1.245472
H  0.246864 0.863485 1.470931
H  -0.657289 1.634263 -1.373632
H  -2.873189 0.99377 -0.524668
H  0.547411 2.41691 0.682215
H  -0.318684 -1.453475 1.464354
totalener: -312.21521856 hartree
nucrepener: 379.04844163 hartree
electener: -691.26366020 hartree
oneelecener: -1159.16322557 hartree
twoeener: 467.89956537 hartree
kineticenergy: 309.98165549 hartree
exchangeener: -36.297055170953 hartree
correlationener: -2.303159078575 hartree
xcener: -38.600214249528 hartree
chargesum: 1.0000000
charge: -0.193963 0.168345 -0.182374 0.168601 -0.132120 -0.100612 -0.168885 0.128622 0.145817 -0.195465 0.130831 0.150632 -0.169615 0.105318 0.132610 0.158842 0.138986 0.208002 0.172371 0.184298 0.149760
charge: 0.130994 0.012676 0.163395 0.003172 0.029797 0.057105 0.074624 -0.004646 -0.001567 0.112831 -0.011086 -0.001642 0.087709 0.314903 -0.019363 -0.002938 0.005104 0.018966 0.005297 0.049613 -0.024943
qa: -0.1940 0.1683 -0.1824 0.1686 -0.1321 -0.1006 -0.1689 0.1286 0.1458 -0.1955 0.1308 0.1506 -0.1696 0.1053 0.1326 0.1588 0.1390 0.2080 0.1724 0.1843 0.1498
va: 3.8232 0.9824 3.8494 0.9746 3.7810 3.8075 3.8552 0.9933 0.9839 3.8391 0.9897 0.9801 3.8573 3.5212 0.9941 0.9829 1.0008 0.9678 0.9825 0.9737 0.9942
energy: -312.215218564666
dipole: 0.27364 -1.06410 -0.79046 1.93484 -0.66987 1.26497 0.24175 -0.37341 -0.13166
magnitude: 1.49744 au
magnitude: 3.80618 debye
