program: Orca
programVersion: 5.0.3
elementType: C H C H C C C H H C H H C C H H H H H H H
charge: 1
multiplicity: 1
keywords: DSD-PBEP86 cc-pVTZ EnGrad RIJCOSX verytightscf cc-pVTZ/C def2/J soscf
formula: C8H13
InChI: InChI=1/C8H13/c1-2-4-6-8-7-5-3-1/h1-2,7H,3-6,8H2
21 atoms
C  -1.996975 0.518036 0.098601
H  -2.187666 0.747785 1.150253
C  -1.996188 -1.015746 -0.146621
H  -2.682987 -1.597653 0.468833
C  -0.542865 -1.086784 0.278775
C  0.586157 -1.071387 -0.521172
C  1.901934 -0.631349 0.041056
H  2.002501 -0.969803 1.077878
H  2.733866 -1.039923 -0.538396
C  1.930933 0.935625 -0.001964
H  2.113469 1.266311 -1.030737
H  2.756913 1.307351 0.610034
C  0.571037 1.47347 0.482542
C  -0.502978 0.715989 -0.250467
H  0.49846 -1.273147 -1.58798
H  -2.139135 -1.267592 -1.201136
H  0.452758 1.384056 1.56773
H  -0.392002 0.802993 -1.334772
H  -2.6631 1.110344 -0.534304
H  0.474935 2.538443 0.229253
H  -0.379216 -1.040052 1.356098
totalener: -311.18228108 hartree
nucrepener: 387.38781538 hartree
electener: -698.57009646 hartree
oneelecener: -1174.94626222 hartree
twoeener: 476.37616575 hartree
kineticenergy: 309.75512409 hartree
exchangeener: -12.764078497460 hartree
correlationener: -0.949794364828 hartree
xcener: -13.713872862288 hartree
chargesum: 1.0000000
charge: -0.213492 0.169790 -0.245566 0.186337 -0.043637 -0.041535 -0.254732 0.166869 0.184681 -0.252329 0.164362 0.182295 -0.239323 -0.098118 0.227010 0.171126 0.161262 0.195172 0.184025 0.192970 0.202832
charge: 0.108359 0.000019 0.108982 -0.000576 0.121187 0.184051 0.085724 0.002876 0.007066 0.096462 -0.006000 0.000269 0.066209 0.186356 0.006500 -0.000210 -0.003084 0.004729 -0.001777 0.016643 0.016217
qa: -0.2135 0.1698 -0.2456 0.1863 -0.0436 -0.0415 -0.2547 0.1669 0.1847 -0.2523 0.1644 0.1823 -0.2393 -0.0981 0.2270 0.1711 0.1613 0.1952 0.1840 0.1930 0.2028
va: 3.8663 0.9856 3.8890 0.9766 3.7874 3.7655 3.9225 0.9823 0.9759 3.8955 0.9802 0.9731 3.8940 3.7760 0.9587 0.9848 0.9844 0.9816 0.9742 0.9680 0.9772
energy: -311.886502601364
dipole: 0.55177 -0.68942 -0.13766 1.84321 -1.94115 -0.09795 0.21798 -0.38817 -0.17019
magnitude: 0.23981 au
magnitude: 0.60954 debye
