program: Orca
programVersion: 5.0.3
elementType: C H C H C C C H H C H H C C H H H H H H H
charge: 1
multiplicity: 1
keywords: DSD-PBEP86/2013 def2-TZVP RIJCOSX verytightscf def2-TZVP/C def2/J soscf noTRAH
formula: C8H13
InChI: InChI=1/C8H13/c1-2-4-6-8-7-5-3-1/h1-2,7H,3-6,8H2
21 atoms
C  -1.995701 0.517715 0.09324
H  -2.188691 0.75516 1.142745
C  -1.997644 -1.017576 -0.141432
H  -2.683347 -1.594112 0.48024
C  -0.543601 -1.087015 0.281192
C  0.58262 -1.067631 -0.52283
C  1.90141 -0.630159 0.036279
H  2.005639 -0.975352 1.070541
H  2.730279 -1.037161 -0.548589
C  1.932873 0.936754 0.002994
H  2.12096 1.273551 -1.02274
H  2.755992 1.303954 0.621486
C  0.570943 1.472743 0.483736
C  -0.499856 0.713181 -0.252761
H  0.491806 -1.271563 -1.588904
H  -2.143619 -1.277222 -1.193608
H  0.449365 1.382242 1.568494
H  -0.386828 0.802035 -1.336689
H  -2.659282 1.106715 -0.545319
H  0.473533 2.537673 0.231146
H  -0.376898 -1.038712 1.357962
totalener: -311.18630477 hartree
nucrepener: 387.43445236 hartree
electener: -698.62075714 hartree
oneelecener: -1175.07503940 hartree
twoeener: 476.45428226 hartree
kineticenergy: 310.03168746 hartree
exchangeener: -12.767296009301 hartree
correlationener: -0.950169581564 hartree
xcener: -13.717465590865 hartree
chargesum: 1.0000000
charge: -0.195899 0.164202 -0.194788 0.178512 -0.062397 -0.036176 -0.224926 0.160411 0.178041 -0.239326 0.153185 0.171851 -0.214715 -0.056725 0.211771 0.159777 0.146264 0.169727 0.173600 0.174069 0.183541
charge: -0.180435 0.152425 -0.177058 0.149279 -0.058081 0.006298 -0.200060 0.155994 0.157305 -0.207108 0.146028 0.150279 -0.222163 -0.007879 0.168108 0.151681 0.149418 0.174731 0.147894 0.166456 0.176890
qa: -0.1959 0.1642 -0.1948 0.1785 -0.0624 -0.0362 -0.2249 0.1604 0.1780 -0.2393 0.1532 0.1719 -0.2147 -0.0567 0.2118 0.1598 0.1463 0.1697 0.1736 0.1741 0.1835
va: 3.8725 0.9745 3.8790 0.9725 3.8468 3.7644 3.9040 0.9668 0.9680 3.8865 0.9711 0.9692 3.9221 3.7571 0.9405 0.9738 0.9730 0.9628 0.9710 0.9678 0.9580
total: -311.871141793 hartree
energy: -311.871141793135
dipole: 0.55187 -0.69327 -0.14140 1.84142 -1.97301 -0.13159 0.22174 -0.42064 -0.19889
magnitude: 0.27725 au
magnitude: 0.70471 debye
