program: Orca
programVersion: 5.0.3
elementType: C H C H C C C H H C H H C C H H H H H H H
charge: 1
multiplicity: 1
keywords: b3lyp def2-TZVP EnGrad D3BJ RIJCOSX verytightscf def2/J soscf
formula: C8H13
InChI: InChI=1/C8H13/c1-2-4-6-8-7-5-3-1/h1-2,7H,3-6,8H2
21 atoms
C  -2.006342 0.696513 0.088695
H  -2.217558 0.878759 1.146578
C  -1.791339 -0.920639 -0.138508
H  -2.625917 -1.408597 0.368296
C  -0.436944 -1.339212 0.410448
C  0.698936 -1.279955 -0.361726
C  2.010422 -0.684096 0.078725
H  2.224485 -0.882339 1.133567
H  2.857425 -1.01475 -0.525267
C  1.80882 0.911059 -0.138895
H  1.872525 1.13569 -1.208513
H  2.625999 1.427988 0.367371
C  0.433965 1.299085 0.416659
C  -0.71675 1.307741 -0.357984
H  0.531447 -1.202853 -1.440463
H  -1.865782 -1.130927 -1.20969
H  0.015839 0.049279 0.366578
H  -0.564058 1.276896 -1.441024
H  -2.862346 1.004668 -0.51362
H  0.343687 1.453575 1.495649
H  -0.345059 -1.475797 1.490297
totalener: -312.18490749 hartree
nucrepener: 382.47480231 hartree
electener: -694.65970980 hartree
oneelecener: -1165.57544449 hartree
twoeener: 470.91573469 hartree
kineticenergy: 310.49320043 hartree
exchangeener: -36.314864754017 hartree
correlationener: -2.308553210232 hartree
xcener: -38.623417964249 hartree
chargesum: 1.0000000
charge: -0.207577 0.156630 -0.257287 0.173107 -0.088550 -0.020496 -0.207246 0.152861 0.168436 -0.261071 0.161431 0.171485 -0.074691 -0.002479 0.144485 0.163818 0.140530 0.154276 0.171740 0.184482 0.176118
charge: -0.192927 0.154240 -0.188813 0.157757 -0.159426 -0.071705 -0.199496 0.152948 0.155954 -0.192869 0.152088 0.156243 -0.159816 -0.041791 0.162337 0.152538 0.308215 0.165003 0.157666 0.168681 0.163175
qa: -0.2076 0.1566 -0.2573 0.1731 -0.0886 -0.0205 -0.2072 0.1529 0.1684 -0.2611 0.1614 0.1715 -0.0747 -0.0025 0.1445 0.1638 0.1405 0.1543 0.1717 0.1845 0.1761
va: 3.8473 0.9693 3.9263 0.9673 3.7015 3.8416 3.8530 0.9696 0.9671 3.9293 0.9653 0.9689 3.6650 3.8395 0.9656 0.9651 1.0150 0.9626 0.9661 0.9588 0.9614
dispcorr: -0.037068439 hartree
energy: -312.221975926658
dipole: -0.00872 -0.07966 -0.08837 0.10488 0.03495 0.13983 0.02804 -0.05050 -0.02246
magnitude: 0.16693 au
magnitude: 0.42430 debye
