program: Orca
programVersion: 5.0.3
elementType: C H C H C C C H H C H H C C H H H H H H H
charge: 1
multiplicity: 1
keywords: DSD-PBEP86/2013 def2-TZVP D3BJ RIJCOSX verytightscf def2-TZVP/C def2/J soscf noTRAH
formula: C8H13
InChI: InChI=1/C8H13/c1-2-4-6-8-7-5-3-1/h1-2,7H,3-6,8H2
21 atoms
C  -1.997337 0.757331 0.071798
H  -2.167639 0.84189 1.14797
C  -1.733191 -0.958497 -0.154131
H  -2.618429 -1.316644 0.375989
C  -0.420172 -1.383194 0.395913
C  0.688589 -1.279648 -0.373114
C  2.003315 -0.689343 0.063908
H  2.213385 -0.882647 1.121545
H  2.856885 -1.0320 -0.526581
C  1.791758 0.869113 -0.143279
H  1.83982 1.124452 -1.20731
H  2.596901 1.413803 0.356302
C  0.42177 1.254446 0.479802
C  -0.76655 1.307345 -0.378189
H  0.52484 -1.208354 -1.453094
H  -1.837481 -1.123369 -1.226995
H  0.168956 0.487078 1.224729
H  -0.655465 1.541149 -1.441054
H  -2.879794 0.986557 -0.524294
H  0.442005 2.149562 1.126315
H  -0.340147 -1.49567 1.477219
totalener: -311.11612316 hartree
nucrepener: 379.77163764 hartree
electener: -690.88776080 hartree
oneelecener: -1159.95820205 hartree
twoeener: 469.07044125 hartree
kineticenergy: 310.01334550 hartree
exchangeener: -14.120397842822 hartree
correlationener: -0.943518890951 hartree
xcener: -15.063916733773 hartree
chargesum: 1.0000000
charge: -0.266340 0.198565 -0.203994 0.193741 -0.205268 -0.110454 -0.213869 0.155738 0.165704 -0.278742 0.153707 0.169159 -0.137615 0.102747 0.140829 0.185861 0.143470 0.211592 0.195854 0.222937 0.176378
charge: -0.167445 0.167588 -0.118236 0.159051 -0.193917 -0.118165 -0.212769 0.148064 0.147352 -0.201547 0.141368 0.150330 -0.213405 0.151463 0.150831 0.152983 0.185160 0.173232 0.158500 0.190777 0.148782
qa: -0.2663 0.1986 -0.2040 0.1937 -0.2053 -0.1105 -0.2139 0.1557 0.1657 -0.2787 0.1537 0.1692 -0.1376 0.1027 0.1408 0.1859 0.1435 0.2116 0.1959 0.2229 0.1764
va: 3.8660 0.9592 3.8442 0.9565 3.8319 3.8621 3.8657 0.9716 0.9740 3.9101 0.9688 0.9697 3.7316 3.5588 0.9680 0.9595 1.0104 0.9464 0.9646 0.9410 0.9618
total: -311.771997426 hartree
dispcorr: -0.014269176 hartree
energy: -311.786266602856
dipole: 0.13460 -1.04154 -0.90694 1.39094 -0.20393 1.18700 0.42216 -0.57939 -0.15723
magnitude: 1.50208 au
magnitude: 3.81798 debye
