program: Orca
programVersion: 5.0.3
elementType: C H C H C C C H H C H H C C H H H H H H H
charge: 1
multiplicity: 1
keywords: b3lyp cc-pVTZ EnGrad D3BJ RIJCOSX verytightscf cc-pVTZ/C def2/J soscf
formula: C8H13
InChI: InChI=1/C8H13/c1-2-4-6-8-7-5-3-1/h1-2,7H,3-6,8H2
21 atoms
C  -2.003907 0.71726 0.082113
H  -2.210494 0.876792 1.144293
C  -1.768158 -0.926107 -0.142819
H  -2.61981 -1.375388 0.372459
C  -0.430778 -1.352189 0.41037
C  0.698596 -1.284185 -0.363371
C  2.009682 -0.686795 0.07213
H  2.223485 -0.880219 1.128528
H  2.859252 -1.019801 -0.527654
C  1.803215 0.90083 -0.143083
H  1.862716 1.133158 -1.211484
H  2.618443 1.42568 0.358531
C  0.426383 1.278391 0.432095
C  -0.736718 1.318265 -0.367043
H  0.530658 -1.205896 -1.442164
H  -1.853667 -1.128735 -1.2133
H  0.057067 0.155712 0.645081
H  -0.591311 1.316483 -1.451787
H  -2.867281 0.995704 -0.523404
H  0.358437 1.632257 1.467222
H  -0.347434 -1.514489 1.487235
totalener: -312.18053910 hartree
nucrepener: 381.64974659 hartree
electener: -693.83028569 hartree
oneelecener: -1164.03393284 hartree
twoeener: 470.20364715 hartree
kineticenergy: 309.94048002 hartree
exchangeener: -36.289521631987 hartree
correlationener: -2.307352989853 hartree
xcener: -38.596874621840 hartree
chargesum: 1.0000000
charge: -0.189891 0.151512 -0.214559 0.164193 -0.086744 -0.046664 -0.184957 0.137673 0.154627 -0.207608 0.139848 0.155155 -0.104627 0.043813 0.147473 0.149831 0.113010 0.169887 0.167925 0.178184 0.161919
charge: 0.115981 0.000739 0.129853 0.003483 0.064701 0.133100 0.095354 -0.004576 -0.001823 0.118843 -0.008836 -0.001888 0.104893 0.235380 -0.008757 -0.005858 0.003809 0.005681 0.004163 0.022190 -0.006430
qa: -0.1899 0.1515 -0.2146 0.1642 -0.0867 -0.0467 -0.1850 0.1377 0.1546 -0.2076 0.1398 0.1552 -0.1046 0.0438 0.1475 0.1498 0.1130 0.1699 0.1679 0.1782 0.1619
va: 3.8314 0.9871 3.8820 0.9786 3.7779 3.7812 3.8423 0.9906 0.9803 3.8708 0.9898 0.9838 3.7740 3.6744 0.9900 0.9866 1.0756 0.9837 0.9789 0.9894 0.9925
dispcorr: -0.037312806 hartree
energy: -312.217851906638
dipole: 0.01882 -0.35366 -0.33483 0.38585 0.05122 0.43707 0.21913 -0.24602 -0.02689
magnitude: 0.55125 au
magnitude: 1.40115 debye
