program: Orca
programVersion: 5.0.3
elementType: C H C H C C C H H C H H C C H H H H H H H
charge: 1
multiplicity: 1
keywords: DSD-PBEP86/2013 cc-pVTZ EnGrad RIJCOSX verytightscf cc-pVTZ/C def2/J soscf
formula: C8H13
InChI: InChI=1/C8H13/c1-2-4-6-8-7-5-3-1/h1-2,7H,3-6,8H2
21 atoms
C  -1.995967 0.535077 0.119647
H  -2.172473 0.725128 1.181986
C  -1.939149 -0.991995 -0.172408
H  -2.674167 -1.57969 0.3806
C  -0.507723 -1.166117 0.289423
C  0.615254 -1.141092 -0.497458
C  1.909629 -0.658405 0.067557
H  2.01632 -0.951618 1.117353
H  2.769241 -1.043285 -0.488166
C  1.883066 0.90487 -0.0442
H  1.993525 1.1912 -1.096864
H  2.733336 1.332326 0.493927
C  0.550293 1.481117 0.495134
C  -0.565357 0.873116 -0.273511
H  0.532917 -1.3058 -1.571456
H  -2.045514 -1.195955 -1.242148
H  0.429373 1.33886 1.573688
H  -0.433015 0.937214 -1.356526
H  -2.733235 1.085574 -0.474388
H  0.544408 2.567662 0.304009
H  -0.359879 -1.117185 1.369706
totalener: -311.17405141 hartree
nucrepener: 384.62672897 hartree
electener: -695.80078037 hartree
oneelecener: -1169.50864669 hartree
twoeener: 473.70786632 hartree
kineticenergy: 309.73346822 hartree
exchangeener: -12.758638744790 hartree
correlationener: -0.947141814654 hartree
xcener: -13.705780559444 hartree
chargesum: 1.0000000
charge: -0.224834 0.171076 -0.234872 0.185264 -0.074402 -0.085442 -0.252292 0.166058 0.184307 -0.251699 0.160459 0.184025 -0.237082 -0.046979 0.224386 0.168535 0.168090 0.209136 0.184972 0.201736 0.199559
charge: 0.091753 0.000926 0.096423 -0.000193 0.126966 0.147100 0.078607 0.001223 0.006786 0.097451 -0.005818 0.000165 0.063484 0.254505 -0.000721 0.000484 0.000212 0.003913 0.003281 0.027419 0.006034
qa: -0.2248 0.1711 -0.2349 0.1853 -0.0744 -0.0854 -0.2523 0.1661 0.1843 -0.2517 0.1605 0.1840 -0.2371 -0.0470 0.2244 0.1685 0.1681 0.2091 0.1850 0.2017 0.1996
va: 3.8685 0.9844 3.8876 0.9758 3.8084 3.8049 3.9224 0.9837 0.9759 3.8919 0.9811 0.9716 3.9028 3.7124 0.9606 0.9859 0.9828 0.9717 0.9743 0.9661 0.9768
energy: -311.877628504443
dipole: 0.56306 -0.76832 -0.20526 1.85757 -1.64776 0.20982 0.17950 -0.32406 -0.14456
magnitude: 0.32719 au
magnitude: 0.83164 debye
