program: Gaussian 09
title: 000051193
version: EM64L-G09RevD.01
frameworkgroup: C1[X(C9H15NO3S)]
method: RPBEPBE
basis: SDD
operation: Freq
keyword: #p
keyword: freq=noraman
keyword: PBEPBE/SDD
title: #p freq=noraman PBEPBE/SDD
converged: YES YES NO NO
title: Mulliken charges:
elementType: S O O O N C C C C C C C C C H H H H H H H H H H H H H H H
charge: 0.191404 -0.250597 -0.248450 -0.274646 -0.412243 -0.147306 -0.359594 -0.696654 0.172635 0.248990 -0.773637 -0.497034 -0.282667 -0.510913 0.303789 0.244373 0.276283 0.269530 0.270235 0.338069 0.254114 0.254442 0.215674 0.244643 0.247204 0.241734 0.232985 0.219161 0.228477
chargesum: 0.00000
title: Mulliken charges with hydrogens summed into heavy atoms:
elementType: S O O O N C C C C C C C C C
charge: 0.191404 -0.250597 -0.248450 -0.274646 -0.074174 0.156483 0.161062 -0.156889 0.172635 0.248990 -0.049407 0.236546 -0.049682 -0.063275
polarizability: 1.60552751e+02 1.91865315e+00 1.24648730e+02 4.91336460e+00 -1.63495006e+00 1.15520081e+02
1716.lowfreq: -10.6685 -5.9743 -4.7596 0.0007 0.0023 0.0027 10.2328 18.9335 39.1927
frequency: 9.1990 18.8496 39.1911 40.4034 57.0535 63.5903 71.3368 81.5924 87.5501 95.8884 126.7005 161.8512 193.4049 218.3491 267.9790 276.4430 308.9889 347.1438 379.4642 458.4552 512.0569 569.3258 577.7710 601.1591 635.1083 653.9988 664.8606 698.7365 779.0927 781.6740 828.1949 887.5170 889.1410 944.4085 946.1670 960.9684 987.0792 1016.0836 1026.8844 1043.1667 1072.6572 1113.5696 1122.8794 1151.5205 1163.7066 1175.1291 1223.9903 1242.5695 1263.6082 1280.0200 1290.5079 1334.5899 1356.2800 1388.3811 1393.9091 1423.8984 1449.9466 1451.2636 1453.9347 1461.6555 1463.2050 1469.8932 1481.0969 1602.7680 1605.5995 1628.8940 2997.9710 3006.8698 3009.2361 3010.6522 3022.8080 3072.8802 3096.3039 3098.7691 3098.9782 3102.2566 3115.0830 3129.5400 3158.8124 3209.9720 3512.0497
redmass: 1.7297 4.6845 5.5228 6.8778 3.5562 2.9797 1.3193 1.5389 1.6536 3.1313 4.3481 3.4673 4.1888 4.9059 4.3250 4.4678 3.8797 4.3936 3.4368 4.0983 3.7125 1.5338 3.3969 3.9123 1.3112 3.8040 4.2541 4.7876 1.9075 2.3161 4.1013 1.4008 3.5844 1.5035 2.3246 2.3209 1.6380 1.7988 1.4288 1.6533 2.7645 1.2653 2.0928 1.4548 3.0381 1.6587 1.3766 1.5912 1.2757 1.2572 1.1821 1.8190 1.3717 1.2309 1.1965 1.2011 1.0457 1.0944 1.0502 1.0828 1.1745 1.0906 1.8407 4.1816 7.6954 7.7771 1.0359 1.0662 1.0618 1.0363 1.0626 1.1052 1.1071 1.0979 1.0586 1.1010 1.1050 1.0963 1.1052 1.1151 1.0781
irintensity: 0.9826 0.4824 1.3966 0.3352 0.3363 3.8691 4.3361 0.6262 3.7929 3.1825 9.0526 3.1955 2.7070 10.9935 5.5966 11.7902 1.8262 12.0752 4.9173 11.3727 8.8011 14.4111 28.7127 38.2750 78.1640 3.0166 23.3254 6.2964 10.2309 6.0843 8.4452 56.0442 8.7785 10.0829 72.9176 7.4770 0.9902 7.3328 23.5022 15.6471 2.0298 0.0753 3.5184 0.4910 237.2097 28.2740 35.5335 5.1310 31.6778 25.0797 1.0237 112.0914 17.4094 66.2166 7.8205 28.1155 14.4087 8.9597 13.2936 43.5285 105.7278 7.0644 204.4237 98.5807 244.8124 71.0495 9.1648 3.4498 43.4075 10.5781 13.2339 1.9341 23.1294 9.2271 2.7809 19.2005 23.1411 7.6343 11.3878 12.9488 62.1596
temp: 298.150 k
press: 1.00000 atm
elementType: 16 8 8 8 7 6 6 6 6 6 6 6 6 6 1 1 1 1 1 1 1 1 1 1 1 1 1 1 1
symmnumber: 1
zpe: 604200.8 jmol-1
zpe.correction: 0.230128 hartree
zpe.thermalcorrener: 0.248024 hartree
zpe.thermalcorrenthalpy: 0.248968 hartree
zpe.thermalcorrgfe: 0.178740 hartree
zpe.sumelectzpe: -1029.325364 hartree
zpe.sumelectthermal: -1029.307468 hartree
zpe.sumelectthermalent: -1029.306524 hartree
zpe.sumelectthermalfe: -1029.376752 hartree
dipole: -0.7697 2.9946 2.9918
dipole: 4.3024
quadrupole: -93.0775 -83.8740 -95.9187
quadrupole: -3.2785 -0.7575 -10.9574
quadrupole: -2.1208 7.0827 -4.9620 -3.2785 -0.7575 -10.9574
hfenergy: -1029.5554922 hartree
pointgroup: C01 [X(C9H15N1O3S1)]
dipole: -0.0922158 1.215662 1.174254 debye
polarizability: 160.8325899|-2.6779396|124.6998314|2.3347827|-2.1700826|115.1891404 unknown
InChI: InChI=1S/C9H15NO3S/c1-4-14-6-5-8(9(12)13-3)10-7(2)11/h4,8,10H,1,5-6H2,2-3H3
charge 0 multiplicity 1
29 atoms
S  2.98294 -0.732029 -0.932221
O  -0.75077 2.671417 -0.611572
O  -1.214041 1.799815 1.497904
O  -2.246486 -2.168854 -1.187868
N  -1.608896 -0.698228 0.486651
C  -1.110826 0.300016 -0.466904
C  0.267781 -0.07977 -1.096669
C  1.389593 -0.192238 -0.054789
C  -1.04469 1.641893 0.263608
C  -2.179619 -1.881959 0.047941
C  -2.712594 -2.805035 1.138026
C  -0.628715 4.025643 -0.010446
C  4.065504 -0.916179 0.521107
C  5.405201 -1.112632 0.451871
H  -1.826769 0.37998 -1.307892
H  0.519574 0.685984 -1.852372
H  0.125411 -1.042436 -1.618591
H  1.147293 -0.954536 0.705384
H  1.588853 0.774128 0.44032
H  -1.630266 -0.42206 1.472961
H  -3.784134 -2.99551 0.95538
H  -2.194075 -3.777243 1.073789
H  -2.588394 -2.400082 2.156985
H  0.167211 4.030877 0.752464
H  -1.584264 4.318864 0.454584
H  -0.377512 4.681738 -0.854467
H  3.538407 -0.884187 1.483193
H  5.988761 -1.251825 1.368034
H  5.949623 -1.145849 -0.497911
