program: Orca
programVersion: 5.0.3
elementType: C H C H C C C H H C H H C C H H H H H H H
charge: 1
multiplicity: 1
keywords: DSD-PBEP86 def2-TZVP RIJCOSX verytightscf def2-TZVP/C def2/J soscf noTRAH
formula: C8H13
InChI: InChI=1/C8H13/c1-2-4-6-8-7-5-3-1/h1-2,7H,3-6,8H2
21 atoms
C  -1.99905 0.524404 0.11765
H  -2.179525 0.723718 1.177389
C  -1.97311 -1.003435 -0.166139
H  -2.677779 -1.599465 0.415269
C  -0.528671 -1.112214 0.276295
C  0.603963 -1.10385 -0.510263
C  1.905228 -0.644172 0.060274
H  2.000352 -0.953894 1.106418
H  2.753915 -1.045846 -0.499647
C  1.908607 0.92219 -0.026133
H  2.053154 1.224203 -1.069916
H  2.750778 1.321941 0.544709
C  0.564111 1.479438 0.485207
C  -0.530606 0.774824 -0.254306
H  0.525425 -1.291415 -1.580627
H  -2.097607 -1.222024 -1.230591
H  0.451481 1.375213 1.56945
H  -0.413472 0.844971 -1.338871
H  -2.69688 1.109604 -0.488592
H  0.501929 2.552933 0.250323
H  -0.375982 -1.062804 1.35544
totalener: -311.18380733 hartree
nucrepener: 386.37718399 hartree
electener: -697.56099133 hartree
oneelecener: -1172.99409312 hartree
twoeener: 475.43310180 hartree
kineticenergy: 310.02331155 hartree
exchangeener: -12.765033488110 hartree
correlationener: -0.949132076628 hartree
xcener: -13.714165564738 hartree
chargesum: 1.0000000
charge: -0.198256 0.164137 -0.197212 0.178651 -0.076932 -0.048146 -0.224715 0.159796 0.178077 -0.238298 0.152883 0.173719 -0.209588 -0.042971 0.206898 0.159697 0.149681 0.177640 0.174999 0.178981 0.180960
charge: -0.187657 0.152627 -0.182253 0.149289 -0.062007 -0.006032 -0.203180 0.155169 0.157314 -0.206575 0.146265 0.150589 -0.223542 0.024592 0.166385 0.151847 0.150806 0.172047 0.149813 0.170913 0.173588
qa: -0.1983 0.1641 -0.1972 0.1787 -0.0769 -0.0481 -0.2247 0.1598 0.1781 -0.2383 0.1529 0.1737 -0.2096 -0.0430 0.2069 0.1597 0.1497 0.1776 0.1750 0.1790 0.1810
va: 3.8695 0.9743 3.8731 0.9723 3.8497 3.7880 3.9048 0.9681 0.9680 3.8762 0.9714 0.9675 3.9208 3.7318 0.9446 0.9740 0.9729 0.9585 0.9711 0.9664 0.9598
total: -311.868687861 hartree
energy: -311.868687861370
dipole: 0.55832 -0.71256 -0.15423 1.85073 -1.84729 0.00343 0.19736 -0.39165 -0.19429
magnitude: 0.24809 au
magnitude: 0.63060 debye
