program: Orca
programVersion: 5.0.3
elementType: C H C H C C C H H C H H C C H H H H H H H
charge: 1
multiplicity: 1
keywords: DSD-PBEP86/2013 cc-pVTZ EnGrad D3BJ RIJCOSX verytightscf cc-pVTZ/C def2/J soscf
formula: C8H13
InChI: InChI=1/C8H13/c1-2-4-6-8-7-5-3-1/h1-2,7H,3-6,8H2
21 atoms
C  -2.003188 0.732475 0.07026
H  -2.171557 0.803273 1.147955
C  -1.737325 -0.974824 -0.168646
H  -2.622208 -1.354151 0.347771
C  -0.410202 -1.381127 0.384275
C  0.678489 -1.269194 -0.393122
C  1.991925 -0.703744 0.064015
H  2.192206 -0.919488 1.118867
H  2.850633 -1.038219 -0.525319
C  1.790254 0.834242 -0.128861
H  1.823075 1.097733 -1.19193
H  2.596977 1.383837 0.363445
C  0.430251 1.310297 0.497958
C  -0.762355 1.284124 -0.349583
H  0.515411 -1.188223 -1.472444
H  -1.828578 -1.138695 -1.24356
H  0.235882 0.818798 1.453982
H  -0.658328 1.637441 -1.3796
H  -2.877357 0.996233 -0.52454
H  0.533059 2.395348 0.725759
H  -0.321113 -1.462019 1.466882
totalener: -311.12804076 hartree
nucrepener: 379.05764057 hartree
electener: -690.18568132 hartree
oneelecener: -1158.54802431 hartree
twoeener: 468.36234299 hartree
kineticenergy: 309.73145041 hartree
exchangeener: -14.117757826016 hartree
correlationener: -0.942319973674 hartree
xcener: -15.060077799690 hartree
chargesum: 1.0000000
charge: -0.262075 0.199558 -0.235553 0.196900 -0.162091 -0.130542 -0.233907 0.158001 0.174417 -0.251180 0.157310 0.177337 -0.239381 0.095982 0.163803 0.187500 0.164641 0.239050 0.200440 0.211723 0.188068
charge: 0.130469 0.013854 0.170016 0.004748 0.025175 0.056842 0.071236 -0.003883 -0.001414 0.106986 -0.010766 -0.001157 0.081012 0.316579 -0.017623 -0.001738 0.005867 0.021508 0.006085 0.048583 -0.022378
qa: -0.2621 0.1996 -0.2356 0.1969 -0.1621 -0.1305 -0.2339 0.1580 0.1744 -0.2512 0.1573 0.1773 -0.2394 0.0960 0.1638 0.1875 0.1646 0.2391 0.2004 0.2117 0.1881
va: 3.8787 0.9718 3.9021 0.9667 3.8139 3.8462 3.9007 0.9869 0.9776 3.8858 0.9839 0.9739 3.9147 3.5444 0.9837 0.9737 0.9933 0.9534 0.9745 0.9648 0.9799
dispcorr: -0.014139677 hartree
energy: -311.814607550938
dipole: 0.25106 -1.11358 -0.86252 1.90253 -0.66326 1.23928 0.26897 -0.41107 -0.14210
magnitude: 1.51656 au
magnitude: 3.85478 debye
