program: Gaussian 09
title: 000051215
version: EM64L-G09RevD.01
frameworkgroup: C1[X(C15H12INO2)]
method: RPBEPBE
basis: SDD
operation: Freq
keyword: #p
keyword: freq=noraman
keyword: PBEPBE/SDD
title: #p freq=noraman PBEPBE/SDD
converged: YES YES NO NO
title: Mulliken charges:
elementType: I O O N C C C C C C C C C C C C C C C H H H H H H H H H H H H
charge: 0.089422 -0.371370 -0.258974 -0.201021 -0.691498 0.320387 0.187470 0.266887 0.209878 -0.570170 -0.378365 0.445498 -0.341252 -0.386989 -0.448541 -0.357835 -0.165584 0.207817 -0.749184 0.254816 0.251210 0.316733 0.240769 0.261910 0.244553 0.271641 0.247529 0.366411 0.260181 0.227336 0.250336
chargesum: 0.00000
title: Mulliken charges with hydrogens summed into heavy atoms:
elementType: I O O N C C C C C C C C C C C C C C C
charge: 0.089422 -0.004959 -0.258974 -0.201021 -0.185472 0.320387 0.187470 0.266887 0.209878 -0.253437 -0.137596 0.445498 -0.079341 -0.142436 -0.176900 -0.357835 0.081945 0.207817 -0.011331
polarizability: 4.13952896e+02 -2.00093616e-01 1.87312841e+02 1.58691858e+00 -1.43582982e+00 8.29661539e+01
1716.lowfreq: -3.3567 -0.0008 -0.0006 -0.0003 1.8028 6.9115 28.2641 34.6549 65.7164
frequency: 28.2548 34.6546 65.7110 72.5825 108.4995 137.6605 144.6208 154.4671 161.8749 184.5513 238.8363 255.4878 268.2323 301.4320 305.9831 333.3711 378.7195 384.9429 422.5437 436.4207 492.4578 507.6764 516.0464 552.2355 554.7366 572.7495 576.2774 595.9206 655.9045 674.1821 703.0688 740.5574 755.2422 823.8495 824.3989 839.2077 844.0591 871.6126 907.1106 931.7305 955.0203 961.2089 970.3602 990.1514 1005.1243 1021.7456 1031.4569 1052.8436 1108.3615 1134.8252 1135.4237 1154.1825 1179.1694 1203.6203 1211.6499 1242.5475 1278.2118 1300.0926 1306.2818 1344.0235 1364.9496 1379.0514 1383.1561 1409.4334 1425.5875 1442.7287 1445.0312 1452.6715 1456.7894 1478.0903 1571.6996 1583.4398 1599.5529 1606.9607 1624.5085 2988.4329 3003.2800 3033.6055 3091.6821 3135.5993 3137.0433 3138.2176 3153.8404 3170.1554 3182.7304 3194.7493 3434.7398
redmass: 5.9576 6.3998 4.4795 7.5476 5.1380 1.1240 4.7019 8.0447 5.1582 5.4665 2.1405 6.2611 6.5811 1.8659 1.8222 6.0526 4.8903 5.0629 2.7444 3.0269 5.3401 5.0247 3.4024 6.1655 3.2093 4.3158 6.2643 3.5582 6.9437 6.5019 3.5963 5.7975 3.1003 2.9599 1.6910 5.7732 1.6282 1.4239 1.3971 3.2692 1.4213 1.4435 1.7851 5.6677 2.0109 3.3972 1.8663 2.1624 2.4438 1.1987 1.6510 1.4572 2.0127 1.5705 2.6848 1.7787 1.4483 1.9395 2.0023 2.1846 6.8617 2.5446 1.4631 3.3620 1.1894 4.0626 1.1076 2.8446 1.0506 3.4984 7.7690 7.5640 7.8100 7.6088 7.5442 1.0610 1.0373 1.0994 1.0964 1.0900 1.1010 1.0900 1.0928 1.0958 1.0934 1.0933 1.0682
irintensity: 0.7448 3.4216 3.3924 0.9777 1.1810 3.0105 2.3853 1.2206 2.1457 7.5129 13.4639 5.7410 8.5329 43.5928 77.1463 35.7595 6.7205 0.7790 12.7743 0.2344 4.1664 3.3381 7.1490 0.8293 1.5908 21.5164 1.1532 1.7421 1.4555 1.3015 6.6969 8.9404 0.6308 44.2080 71.6224 10.5283 9.6862 11.2287 3.0539 10.8005 2.8174 8.2681 13.8401 30.2342 27.2650 15.7799 9.3330 25.0735 11.2604 0.6796 4.7216 7.2397 12.4973 1.9815 25.1402 79.7579 53.4411 10.3158 184.5604 246.4851 2.6636 138.7865 4.1055 32.5837 24.5542 72.4600 22.9879 110.9208 18.6821 18.9892 11.3632 8.1800 140.3840 18.0737 21.3104 8.4961 7.8421 5.3318 11.4472 4.5227 9.8360 12.5912 3.3829 8.1158 3.4025 4.3575 8.0847
temp: 298.150 k
press: 1.00000 atm
elementType: 53 8 8 7 6 6 6 6 6 6 6 6 6 6 6 6 6 6 6 1 1 1 1 1 1 1 1 1 1 1 1
symmnumber: 1
zpe: 603108.7 jmol-1
zpe.correction: 0.229712 hartree
zpe.thermalcorrener: 0.246758 hartree
zpe.thermalcorrenthalpy: 0.247702 hartree
zpe.thermalcorrgfe: 0.182861 hartree
zpe.sumelectzpe: -794.151361 hartree
zpe.sumelectthermal: -794.134315 hartree
zpe.sumelectthermalent: -794.133371 hartree
zpe.sumelectthermalfe: -794.198212 hartree
dipole: 3.0537 2.5036 2.0438
dipole: 4.4464
quadrupole: -111.8296 -118.5672 -126.9994
quadrupole: 12.6272 12.4570 0.2352
quadrupole: 7.3025 0.5649 -7.8673 12.6272 12.4570 0.2352
hfenergy: -794.3810729 hartree
pointgroup: C01[X(C15H12I1N1O2)]
dipole: 1.1459298 -1.0635043 -0.7848288 debye
polarizability: 413.3486761|-11.6026782|187.7930591|-2.5421844|-3.6206553|83.0901557 unknown
InChI: InChI=1S/C15H12INO2/c1-9(18)17(19)13-3-5-15-11(8-13)6-10-7-12(16)2-4-14(10)15/h2-5,7-8,19H,6H2,1H3
charge 0 multiplicity 1
31 atoms
I  -6.767419 0.818093 -0.028571
O  4.427096 -1.452107 -0.227445
O  3.968349 2.083484 0.236681
N  3.693448 -0.197155 -0.149976
C  -1.08167 1.655597 -0.202107
C  0.02862 0.612807 -0.121987
C  -0.536605 -0.690345 0.021424
C  -2.347061 0.810699 -0.097775
C  -2.003732 -0.570085 0.034828
C  1.414827 0.813047 -0.171988
C  0.312257 -1.81232 0.127378
C  2.264899 -0.328276 -0.069929
C  -3.691232 1.222029 -0.117541
C  -3.016601 -1.5472 0.149416
C  1.709411 -1.63067 0.084508
C  -4.692478 0.227449 -0.001266
C  -4.372341 -1.144527 0.131439
C  4.493985 0.947536 0.051014
C  5.99692 0.720665 0.014287
H  -1.009536 2.394895 0.619244
H  -1.043767 2.230454 -1.147776
H  1.851441 1.808132 -0.26388
H  -0.095924 -2.821156 0.252928
H  -3.959419 2.277984 -0.219439
H  -2.772242 -2.61006 0.252122
H  2.378495 -2.486233 0.200489
H  -5.16805 -1.889441 0.219532
H  4.368017 -1.731374 -1.185607
H  6.311196 -0.004572 0.783611
H  6.325211 0.3203 -0.961545
H  6.483406 1.691253 0.19093
