program: Orca
programVersion: 5.0.3
elementType: C H C H C C C H H C H H C C H H H H H H H
charge: 1
multiplicity: 1
keywords: DSD-PBEP86 def2-TZVP RIJCOSX verytightscf def2-TZVP/C def2/J soscf noTRAH
formula: C8H13
InChI: InChI=1/C8H13/c1-2-4-6-8-7-5-3-1/h1-2,7H,3-6,8H2
21 atoms
C  -1.995592 0.536343 0.119336
H  -2.171866 0.725874 1.18184
C  -1.935381 -0.990846 -0.172773
H  -2.673747 -1.577128 0.377426
C  -0.505408 -1.171988 0.291231
C  0.616344 -1.144995 -0.495929
C  1.91024 -0.659857 0.068043
H  2.018524 -0.951448 1.118126
H  2.770736 -1.042938 -0.487654
C  1.880502 0.902986 -0.0461
H  1.98767 1.187981 -1.099487
H  2.731187 1.33338 0.489063
C  0.548584 1.48073 0.496225
C  -0.569224 0.884104 -0.275686
H  0.533183 -1.306675 -1.570344
H  -2.03979 -1.19383 -1.242933
H  0.426623 1.333614 1.573945
H  -0.435906 0.949794 -1.358518
H  -2.736858 1.082477 -0.473926
H  0.54894 2.568487 0.310565
H  -0.35808 -1.124046 1.371663
totalener: -311.17721232 hartree
nucrepener: 384.43807379 hartree
electener: -695.61528611 hartree
oneelecener: -1169.17331432 hartree
twoeener: 473.55802821 hartree
kineticenergy: 310.00826644 hartree
exchangeener: -12.761446413606 hartree
correlationener: -0.947298704787 hartree
xcener: -13.708745118393 hartree
chargesum: 1.0000000
charge: -0.205745 0.166287 -0.202293 0.178638 -0.092975 -0.089308 -0.224821 0.158426 0.174986 -0.236773 0.151698 0.174583 -0.204857 0.003856 0.196938 0.161308 0.155272 0.191722 0.178165 0.187666 0.177225
charge: -0.195187 0.153940 -0.190135 0.149747 -0.064451 -0.048177 -0.209851 0.153446 0.156166 -0.206089 0.146135 0.150499 -0.223565 0.088057 0.162427 0.152340 0.153175 0.171690 0.154058 0.178469 0.167304
qa: -0.2057 0.1663 -0.2023 0.1786 -0.0930 -0.0893 -0.2248 0.1584 0.1750 -0.2368 0.1517 0.1746 -0.2049 0.0039 0.1969 0.1613 0.1553 0.1917 0.1782 0.1877 0.1772
va: 3.8627 0.9727 3.8613 0.9717 3.8496 3.8291 3.9027 0.9695 0.9690 3.8667 0.9716 0.9657 3.9145 3.6661 0.9508 0.9741 0.9721 0.9503 0.9703 0.9635 0.9610
total: -311.861309779 hartree
energy: -311.861309779085
dipole: 0.56285 -0.83428 -0.27143 1.85862 -1.54637 0.31224 0.17767 -0.35506 -0.17739
magnitude: 0.45015 au
magnitude: 1.14420 debye
