program: Orca
programVersion: 5.0.3
elementType: C H C H C C C H H C H H C C H H H H H H H
charge: 1
multiplicity: 1
keywords: DSD-PBEP86/2013 cc-pVTZ EnGrad D3BJ RIJCOSX verytightscf cc-pVTZ/C def2/J soscf
formula: C8H13
InChI: InChI=1/C8H13/c1-2-4-6-8-7-5-3-1/h1-2,7H,3-6,8H2
21 atoms
C  -1.989926 0.565932 0.10131
H  -2.166235 0.747497 1.166609
C  -1.864111 -0.970542 -0.174585
H  -2.661125 -1.521925 0.331294
C  -0.462243 -1.268759 0.331099
C  0.637503 -1.211841 -0.46024
C  1.928962 -0.685464 0.072563
H  2.074092 -0.946276 1.126167
H  2.797632 -1.037586 -0.493145
C  1.839818 0.867839 -0.083638
H  1.89749 1.132794 -1.146018
H  2.685105 1.35269 0.413002
C  0.509095 1.450537 0.511011
C  -0.645139 1.083948 -0.310601
H  0.529645 -1.294537 -1.542591
H  -1.934632 -1.167356 -1.249239
H  0.370177 1.190365 1.563736
H  -0.528116 1.282985 -1.380408
H  -2.79513 1.019918 -0.487404
H  0.614673 2.551151 0.442653
H  -0.329374 -1.266632 1.414461
totalener: -311.14916573 hartree
nucrepener: 381.33132632 hartree
electener: -692.48049206 hartree
oneelecener: -1163.02693878 hartree
twoeener: 470.54644672 hartree
kineticenergy: 309.72447803 hartree
exchangeener: -14.120670227654 hartree
correlationener: -0.944043376425 hartree
xcener: -15.064713604079 hartree
chargesum: 1.0000000
charge: -0.225176 0.176244 -0.226053 0.181365 -0.116526 -0.139388 -0.239593 0.163326 0.179790 -0.244324 0.156410 0.181502 -0.231373 0.029905 0.205188 0.165347 0.171727 0.227668 0.185471 0.208821 0.189666
charge: 0.089058 0.005285 0.091779 -0.000351 0.105267 0.086576 0.072368 -0.001283 0.005488 0.106857 -0.007416 -0.000528 0.069701 0.333187 -0.011480 0.000020 0.003192 0.013465 0.008506 0.039102 -0.008792
qa: -0.2252 0.1762 -0.2261 0.1814 -0.1165 -0.1394 -0.2396 0.1633 0.1798 -0.2443 0.1564 0.1815 -0.2314 0.0299 0.2052 0.1653 0.1717 0.2277 0.1855 0.2088 0.1897
va: 3.8573 0.9811 3.8960 0.9751 3.8294 3.8377 3.9103 0.9853 0.9770 3.8826 0.9831 0.9724 3.9075 3.5912 0.9703 0.9861 0.9842 0.9588 0.9759 0.9656 0.9801
dispcorr: -0.014274060 hartree
energy: -311.835185042277
dipole: 0.51931 -0.89541 -0.37610 1.91260 -1.10904 0.80356 0.14891 -0.28217 -0.13325
magnitude: 0.89717 au
magnitude: 2.28043 debye
