program: Gaussian 09
title: 000051221
version: EM64L-G09RevD.01
frameworkgroup: C1[X(C20H18O9)]
method: RPBEPBE
basis: SDD
operation: Freq
keyword: #pfreq=noraman
keyword: PBEPBE/SDD
title: #p freq=noraman PBEPBE/SDD
converged: NO YES NO NO
title: Mulliken charges:
elementType: O O O O O O O O O C C C C C C C C C C C C C C C C C C C C H H H H H H H H H H H H H H H H H H
charge: -0.415372 -0.429986 -0.430728 -0.256427 -0.476687 -0.183219 -0.392265 -0.410719 -0.288475 -0.176971 0.145425 -0.439632 0.093073 0.051658 -0.401117 0.361772 0.219478 -0.678388 -0.306257 0.111313 0.076158 0.363469 -0.318397 0.174764 -0.621430 0.372082 -0.512957 0.318856 -0.754224 0.280464 0.246969 0.220688 0.214725 0.228809 0.294195 0.250734 0.223286 0.290444 0.409712 0.340448 0.384240 0.289041 0.412960 0.369922 0.255190 0.251341 0.242035
chargesum: 0.00000
title: Mulliken charges with hydrogens summed into heavy atoms:
elementType: O O O O O O O O O C C C C C C C C C C C C C C C C C C C C
charge: -0.005660 -0.089537 -0.046488 -0.256427 -0.476687 -0.183219 0.020695 -0.040797 -0.288475 0.103493 0.145425 0.028024 0.093073 0.051658 0.042418 0.361772 0.219478 -0.384193 0.167763 0.111313 0.076158 0.363469 -0.318397 0.174764 -0.330986 0.372082 -0.223915 0.318856 -0.005659
polarizability: 4.52761332e+02 2.37778725e+01 2.71829087e+02 3.22914478e+01 -3.56744390e+01 1.48246519e+02
1716.lowfreq: -14.8343 -6.2102 -0.0004 0.0001 0.0007 1.0215 3.8907 25.4550 33.0772
frequency: -14.2826 25.2894 33.0565 41.2475 44.8712 60.1421 68.7234 77.0788 81.2534 110.8136 120.5812 138.0642 148.0661 159.1229 175.7924 185.6044 199.9415 229.4080 251.5973 266.8602 270.5244 275.8029 289.9823 299.4466 305.5956 317.7886 335.6606 357.3380 370.1971 371.6743 401.3321 410.5039 421.0530 442.2550 448.7744 459.9667 470.6252 476.7790 514.5941 520.9386 529.4654 562.4164 564.4418 586.9518 600.0466 603.1415 605.2836 608.6477 623.2817 680.5666 712.4085 717.8977 734.9359 756.7744 765.5419 775.3923 814.8038 853.5662 871.6756 884.0046 909.1669 918.4818 920.9838 930.7949 933.9882 964.8743 974.3426 990.2553 999.3432 1003.8027 1016.2658 1032.6240 1042.0352 1050.0310 1084.0621 1097.5132 1108.5510 1131.4845 1162.6079 1180.6322 1183.7375 1191.8819 1195.6993 1209.2757 1218.3384 1224.6835 1236.8381 1294.7473 1300.3168 1315.9786 1327.0046 1336.9852 1341.5442 1345.0221 1354.9959 1367.8229 1382.9082 1384.9571 1393.9809 1414.9063 1425.3392 1437.9614 1451.9980 1453.2299 1455.8534 1456.2537 1464.5565 1475.7807 1476.8072 1502.9554 1540.2885 1568.9352 1570.2752 1588.5642 1607.2939 1637.7950 1657.4465 2651.4320 2819.4146 2995.6033 3003.9978 3005.1690 3020.3451 3046.3916 3062.0102 3081.7362 3090.1737 3098.7392 3135.9853 3141.5444 3145.3126 3195.8970 3554.8806 3575.0011 3577.6444
redmass: 5.3075 6.9481 5.6098 7.5703 3.5031 1.3772 5.2167 2.7898 4.3031 5.4275 5.7125 6.5857 5.8108 5.2088 5.0708 5.0633 4.3247 4.8586 3.4132 4.8014 6.6434 2.2772 2.3361 1.9258 2.5056 3.0925 5.2519 5.2968 5.8236 6.8119 3.7632 1.1223 5.2157 8.3736 4.0238 5.4551 10.9771 4.0177 4.7524 4.6697 6.4914 6.4949 3.1673 4.7296 5.4335 5.3713 6.8094 5.7400 4.1454 4.7396 6.0418 5.1360 4.2544 5.2963 6.6379 5.2574 2.9910 1.8696 1.5652 1.4938 4.4278 2.1475 4.1664 1.0612 2.6691 3.1808 3.8840 1.0754 3.3020 2.1193 4.4394 3.5534 1.6789 2.2577 3.1922 3.4736 2.6989 1.7190 1.3530 1.4427 1.4432 2.2432 1.8981 2.0351 1.6162 1.8817 1.3044 1.2010 2.8481 4.4074 1.5014 4.1347 2.6791 1.7901 1.3388 1.5769 1.2591 1.3505 3.1281 2.2533 3.1192 4.5342 2.2305 1.2021 1.1956 1.1339 6.1285 1.0951 1.1156 3.7180 8.0366 5.4320 3.9801 3.9671 4.0150 8.4554 3.9840 1.0718 1.0705 1.0601 1.0609 1.0383 1.0589 1.0874 1.0962 1.1036 1.1081 1.0944 1.0920 1.1022 1.0920 1.0932 1.0659 1.0661 1.0662
irintensity: 15.8245 4.8411 0.5954 0.6541 5.3069 3.6607 1.9834 9.4584 17.0906 1.4618 1.2213 1.7039 2.0553 7.4900 1.3923 5.6553 1.8726 1.4169 5.8174 5.5423 11.9204 64.6910 85.0136 73.5069 40.4929 30.4618 7.5906 11.5190 5.1375 2.0890 6.5408 150.2951 4.8932 14.8899 10.0404 8.7348 0.8254 3.0757 6.0472 5.1544 16.0545 17.9670 4.7637 3.5544 2.4409 32.3699 6.4180 21.5052 9.6686 2.9539 2.2693 0.3634 29.1439 10.1765 13.8541 3.5744 23.8387 8.6345 36.6359 2.7910 22.4530 30.7559 13.2074 56.9859 17.6482 36.0405 19.0124 180.4042 23.5175 67.6648 52.1272 105.0733 16.8159 43.9115 53.2338 100.2606 13.6386 217.6657 42.3037 59.7033 51.7929 60.3678 14.1440 168.5292 218.4078 132.8256 52.4964 31.4987 73.1219 92.1391 143.3460 149.3381 560.9703 217.7183 22.5220 109.0707 36.6443 56.7249 11.5149 20.1743 278.2332 144.7821 45.4137 22.2840 25.4823 18.9345 176.0202 10.6757 10.7320 28.8853 234.6870 25.8261 204.0745 121.6679 264.0154 135.4599 71.6733 387.3772 149.9446 21.2428 53.1654 1.7830 25.4724 2.8594 7.5092 38.6065 28.5122 10.8546 4.9812 7.6923 2.1857 0.2351 5.0417 129.5677 100.1155
temp: 298.150 k
press: 1.00000 atm
elementType: 8 8 8 8 8 8 8 8 8 6 6 6 6 6 6 6 6 6 6 6 6 6 6 6 6 6 6 6 6 1 1 1 1 1 1 1 1 1 1 1 1 1 1 1 1 1 1
symmnumber: 1
zpe: 912007.0 jmol-1
zpe.correction: 0.347365 hartree
zpe.thermalcorrener: 0.373442 hartree
zpe.thermalcorrenthalpy: 0.374386 hartree
zpe.thermalcorrgfe: 0.290962 hartree
zpe.sumelectzpe: -1447.891378 hartree
zpe.sumelectthermal: -1447.865301 hartree
zpe.sumelectthermalent: -1447.864357 hartree
zpe.sumelectthermalfe: -1447.947782 hartree
dipole: 0.3502 -2.7604 -1.1680
dipole: 3.0177
quadrupole: -153.4881 -170.5913 -175.5975
quadrupole: 5.7255 -12.9085 -8.3210
quadrupole: 13.0709 -4.0323 -9.0385 5.7255 -12.9085 -8.3210
hfenergy: -1448.2387436 hartree
pointgroup: C01 [X(C20H18O9)]
dipole: 0.1512198 -1.1175052 -0.3713782 debye
polarizability: 450.729899|27.9232873|265.8396973|38.5602951|-43.8269699|156.2673422 unknown
InChI: InChI=1S/C20H18O9/c1-8(22)29-3-2-9(7-21)15-14(25)6-12-17(19(15)27)20(28)16-11(18(12)26)4-10(23)5-13(16)24/h4-6,9,21,23-25,27H,2-3,7H2,1H3
charge 0 multiplicity 1
47 atoms
O  0.67147 2.47025 -0.429238
O  2.926261 2.531795 2.680199
O  2.919708 -1.270003 1.590698
O  5.051902 -0.454709 -1.255695
O  -1.792886 2.341333 -0.858018
O  -1.984987 -2.78752 1.211218
O  -4.282962 2.285471 -1.33158
O  -6.812582 -1.611898 -0.220374
O  3.888279 -2.444076 -0.844663
C  3.182763 1.32503 0.488148
C  1.834275 0.618315 0.587174
C  3.612093 1.533274 -0.994404
C  -0.625957 0.490948 0.148395
C  0.623992 1.202113 0.104943
C  3.209808 2.681537 1.24755
C  -0.657575 -0.83915 0.674771
C  1.744466 -0.702555 1.100998
C  0.52233 -1.42797 1.146664
C  3.826681 0.232309 -1.776132
C  -1.838443 1.110476 -0.355662
C  -3.099529 0.396806 -0.314759
C  -3.172201 -0.929909 0.217272
C  -1.939986 -1.607893 0.736983
C  -4.3020 1.017853 -0.811042
C  -4.395225 -1.615679 0.258481
C  -5.569781 -0.980253 -0.2358
C  -5.531829 0.322364 -0.767089
C  4.94858 -1.772859 -0.813215
C  6.279183 -2.245945 -0.268821
H  3.926842 0.673157 0.977373
H  2.846741 2.132381 -1.522897
H  4.554152 2.114981 -1.013232
H  4.2358 3.086091 1.214323
H  2.51725 3.403949 0.775217
H  0.476637 -2.445464 1.550635
H  2.972862 -0.46377 -1.700374
H  4.040058 0.441989 -2.838503
H  -4.41081 -2.63073 0.672983
H  -0.298725 2.717632 -0.723076
H  1.998792 2.199731 2.787588
H  2.899664 -2.257539 1.522086
H  -6.440974 0.79611 -1.142871
H  -3.308734 2.626482 -1.278384
H  -6.753532 -2.52122 0.166445
H  6.42442 -1.831095 0.745662
H  7.109714 -1.886308 -0.896545
H  6.289498 -3.344233 -0.210133
