program: Orca
programVersion: 5.0.3
elementType: C H C H C C C H H C H H C C H H H H H H H
charge: 1
multiplicity: 1
keywords: DSD-PBEP86 cc-pVTZ EnGrad RIJCOSX verytightscf cc-pVTZ/C def2/J soscf
formula: C8H13
InChI: InChI=1/C8H13/c1-2-4-6-8-7-5-3-1/h1-2,7H,3-6,8H2
21 atoms
C  -2.003255 0.719946 0.081453
H  -2.208405 0.87561 1.144444
C  -1.765461 -0.927415 -0.143356
H  -2.619477 -1.370913 0.373187
C  -0.430247 -1.354162 0.409795
C  0.698218 -1.284382 -0.363675
C  2.009389 -0.686922 0.071492
H  2.223102 -0.879851 1.128084
H  2.859268 -1.020539 -0.527638
C  1.802615 0.89951 -0.143466
H  1.861909 1.132933 -1.21166
H  2.617423 1.425459 0.357786
C  0.425769 1.275633 0.43438
C  -0.739211 1.318866 -0.368471
H  0.53067 -1.206957 -1.442581
H  -1.852427 -1.128192 -1.213857
H  0.06392 0.172139 0.683857
H  -0.595897 1.326173 -1.453431
H  -2.867911 0.994388 -0.523968
H  0.361388 1.659858 1.459495
H  -0.34752 -1.516113 1.48674
totalener: -311.09235488 hartree
nucrepener: 381.52874039 hartree
electener: -692.62109527 hartree
oneelecener: -1163.17412670 hartree
twoeener: 470.55303143 hartree
kineticenergy: 309.66441545 hartree
exchangeener: -12.747453429578 hartree
correlationener: -0.947005515223 hartree
xcener: -13.694458944801 hartree
chargesum: 1.0000000
charge: -0.250903 0.183581 -0.281390 0.194337 -0.113710 -0.084507 -0.246252 0.167381 0.183342 -0.274237 0.169630 0.185503 -0.150322 0.027253 0.177269 0.180912 0.115005 0.201439 0.197314 0.218193 0.200164
charge: 0.112574 0.003303 0.127605 0.005281 0.057567 0.124521 0.089369 -0.003182 -0.000608 0.113799 -0.007667 -0.000587 0.102287 0.243431 -0.007822 -0.004232 0.006187 0.009216 0.006171 0.027738 -0.004952
qa: -0.2509 0.1836 -0.2814 0.1943 -0.1137 -0.0845 -0.2463 0.1674 0.1833 -0.2742 0.1696 0.1855 -0.1503 0.0273 0.1773 0.1809 0.1150 0.2014 0.1973 0.2182 0.2002
va: 3.8803 0.9777 3.9423 0.9698 3.8114 3.8319 3.8931 0.9833 0.9727 3.9259 0.9825 0.9759 3.8103 3.7072 0.9789 0.9775 1.0950 0.9709 0.9700 0.9732 0.9767
energy: -311.807157948898
dipole: 0.02443 -0.40969 -0.38526 0.43529 0.07043 0.50572 0.24434 -0.26833 -0.02399
magnitude: 0.63620 au
magnitude: 1.61710 debye
