program: Orca
programVersion: 5.0.3
elementType: C H C H C C C H H C H H C C H H H H H H H
charge: 1
multiplicity: 1
keywords: DSD-PBEP86/2013 def2-TZVP D3BJ RIJCOSX verytightscf def2-TZVP/C def2/J soscf noTRAH
formula: C8H13
InChI: InChI=1/C8H13/c1-2-4-6-8-7-5-3-1/h1-2,7H,3-6,8H2
21 atoms
C  -1.990054 0.575349 0.095461
H  -2.166869 0.75438 1.161619
C  -1.848632 -0.965627 -0.173966
H  -2.656941 -1.508096 0.324161
C  -0.45304 -1.285713 0.340046
C  0.642879 -1.223973 -0.451261
C  1.935482 -0.690686 0.072676
H  2.089711 -0.945078 1.126489
H  2.804098 -1.036618 -0.497383
C  1.83277 0.860538 -0.091529
H  1.883283 1.122486 -1.154874
H  2.673758 1.356827 0.401119
C  0.498557 1.438219 0.511517
C  -0.662231 1.121962 -0.315809
H  0.527869 -1.283846 -1.534836
H  -1.913412 -1.162243 -1.24905
H  0.355978 1.150183 1.556143
H  -0.554564 1.365128 -1.377673
H  -2.806075 1.008187 -0.493693
H  0.620811 2.539222 0.470826
H  -0.324589 -1.298607 1.423709
totalener: -311.15023077 hartree
nucrepener: 380.83062966 hartree
electener: -691.98086042 hartree
oneelecener: -1162.07557517 hartree
twoeener: 470.09471475 hartree
kineticenergy: 310.01804849 hartree
exchangeener: -14.123965451158 hartree
correlationener: -0.943969285902 hartree
xcener: -15.067934737061 hartree
chargesum: 1.0000000
charge: -0.204445 0.172997 -0.208414 0.176489 -0.150709 -0.139286 -0.217636 0.156058 0.167137 -0.243161 0.150757 0.173885 -0.172496 0.087582 0.167126 0.164555 0.161571 0.209792 0.181592 0.201234 0.165372
charge: -0.195370 0.160963 -0.193290 0.150856 -0.104766 -0.124894 -0.219254 0.150753 0.154218 -0.196714 0.144888 0.150540 -0.214376 0.188026 0.155039 0.152788 0.157731 0.174512 0.160724 0.192943 0.154683
qa: -0.2044 0.1730 -0.2084 0.1765 -0.1507 -0.1393 -0.2176 0.1561 0.1671 -0.2432 0.1508 0.1739 -0.1725 0.0876 0.1671 0.1646 0.1616 0.2098 0.1816 0.2012 0.1654
va: 3.8421 0.9678 3.8544 0.9690 3.8705 3.8537 3.8962 0.9719 0.9710 3.8725 0.9709 0.9632 3.8669 3.5288 0.9633 0.9728 0.9757 0.9402 0.9682 0.9569 0.9642
total: -311.802042714 hartree
dispcorr: -0.014237191 hartree
energy: -311.816279904509
dipole: 0.49948 -1.01708 -0.51760 1.93027 -0.84264 1.08763 0.14651 -0.32020 -0.17369
magnitude: 1.21697 au
magnitude: 3.09330 debye
