program: Orca
programVersion: 5.0.3
elementType: C H C H C C C H H C H H C C H H H H H H H
charge: 1
multiplicity: 1
keywords: DSD-PBEP86/2013 def2-TZVP RIJCOSX verytightscf def2-TZVP/C def2/J soscf noTRAH
formula: C8H13
InChI: InChI=1/C8H13/c1-3-7-5-2-6-8(4-1)9-7/h3,6-8H,1-2,4-5H2
21 atoms
C  -2.003122 0.682406 0.09547
H  -2.209706 0.872328 1.15306
C  -1.809653 -0.923788 -0.135045
H  -2.63415 -1.425778 0.374224
C  -0.445184 -1.334739 0.404276
C  0.695117 -1.275653 -0.363027
C  2.00688 -0.678283 0.085183
H  2.216907 -0.879402 1.140112
H  2.853904 -1.01245 -0.516651
C  1.816875 0.920645 -0.134891
H  1.888956 1.142336 -1.204477
H  2.63373 1.431207 0.378312
C  0.44331 1.311829 0.408464
C  -0.703491 1.295445 -0.355866
H  0.535719 -1.219028 -1.443987
H  -1.884868 -1.134994 -1.206364
H  0.005537 0.007984 0.224678
H  -0.556289 1.27821 -1.439636
H  -2.857386 1.00836 -0.500376
H  0.342715 1.375763 1.495092
H  -0.344154 -1.423234 1.488739
totalener: -311.10275266 hartree
nucrepener: 382.76442415 hartree
electener: -693.86717681 hartree
oneelecener: -1165.45128566 hartree
twoeener: 471.58410885 hartree
kineticenergy: 309.93433018 hartree
exchangeener: -12.751921515810 hartree
correlationener: -0.949596659585 hartree
xcener: -13.701518175396 hartree
chargesum: 1.0000000
charge: -0.220269 0.166578 -0.255710 0.183505 -0.127271 -0.043039 -0.222593 0.165486 0.180648 -0.258777 0.169304 0.182945 -0.118375 -0.046839 0.162859 0.169916 0.193518 0.165949 0.181290 0.186476 0.184399
charge: -0.193797 0.151367 -0.191732 0.153862 -0.141964 -0.070691 -0.195227 0.150966 0.154055 -0.192489 0.150088 0.153455 -0.145053 -0.060622 0.163752 0.150331 0.318194 0.164057 0.154385 0.164281 0.162781
qa: -0.2203 0.1666 -0.2557 0.1835 -0.1273 -0.0430 -0.2226 0.1655 0.1806 -0.2588 0.1693 0.1829 -0.1184 -0.0468 0.1629 0.1699 0.1935 0.1659 0.1813 0.1865 0.1844
va: 3.8712 0.9710 3.9255 0.9672 3.7939 3.8676 3.8768 0.9709 0.9673 3.9297 0.9679 0.9678 3.7696 3.8829 0.9655 0.9680 1.0086 0.9638 0.9669 0.9620 0.9624
total: -311.799317676 hartree
energy: -311.799317675633
dipole: -0.00848 -0.01640 -0.02488 0.02045 0.01125 0.03170 -0.05341 0.01145 -0.04196
magnitude: 0.05818 au
magnitude: 0.14788 debye
