program: Orca
programVersion: 5.0.3
elementType: C H C H C C C H H C H H C C H H H H H H H
charge: 1
multiplicity: 1
keywords: b3lyp def2-TZVP EnGrad RIJCOSX verytightscf def2/J soscf
formula: C8H13
InChI: InChI=1/C8H13/c1-2-4-6-8-7-5-3-1/h1-2,7H,3-6,8H2
21 atoms
C  -1.997196 0.756034 0.072292
H  -2.169773 0.844518 1.147854
C  -1.734359 -0.956375 -0.153211
H  -2.618365 -1.317916 0.376716
C  -0.421031 -1.381956 0.396668
C  0.689226 -1.280339 -0.372224
C  2.003753 -0.688911 0.064215
H  2.214207 -0.881502 1.121923
H  2.857099 -1.031373 -0.526607
C  1.792443 0.871637 -0.143757
H  1.841973 1.125601 -1.208075
H  2.598132 1.415291 0.356043
C  0.421719 1.253029 0.477447
C  -0.765854 1.308814 -0.37879
H  0.52555 -1.209498 -1.452209
H  -1.83833 -1.122861 -1.225897
H  0.163676 0.464228 1.195749
H  -0.653427 1.526245 -1.444358
H  -2.878983 0.985748 -0.52473
H  0.436593 2.129442 1.156981
H  -0.341104 -1.497701 1.477789
totalener: -312.20316346 hartree
nucrepener: 379.84989336 hartree
electener: -692.05305682 hartree
oneelecener: -1160.74248608 hartree
twoeener: 468.68942925 hartree
kineticenergy: 310.52575522 hartree
exchangeener: -36.316149993924 hartree
correlationener: -2.304096310101 hartree
xcener: -38.620246304025 hartree
chargesum: 1.0000000
charge: -0.226330 0.185409 -0.212431 0.185937 -0.166570 -0.062288 -0.211079 0.148298 0.156386 -0.259404 0.148292 0.159425 -0.113228 0.076305 0.129132 0.177720 0.132204 0.194463 0.184498 0.209159 0.164102
charge: -0.161450 0.168943 -0.123414 0.164242 -0.187306 -0.105156 -0.214346 0.150612 0.150252 -0.201850 0.144828 0.153819 -0.210132 0.092497 0.152825 0.155320 0.190629 0.169456 0.161354 0.197956 0.150922
qa: -0.2263 0.1854 -0.2124 0.1859 -0.1666 -0.0623 -0.2111 0.1483 0.1564 -0.2594 0.1483 0.1594 -0.1132 0.0763 0.1291 0.1777 0.1322 0.1945 0.1845 0.2092 0.1641
va: 3.8481 0.9605 3.8335 0.9561 3.8013 3.8143 3.8502 0.9689 0.9730 3.8990 0.9669 0.9689 3.7068 3.6124 0.9683 0.9598 1.0167 0.9539 0.9650 0.9466 0.9647
energy: -312.203163463216
dipole: 0.12847 -0.95636 -0.82789 1.33917 -0.34534 0.99383 0.42261 -0.50862 -0.08601
magnitude: 1.29634 au
magnitude: 3.29504 debye
