program: Orca
programVersion: 5.0.3
elementType: C H C H C C C H H C H H C C H H H H H H H
charge: 1
multiplicity: 1
keywords: DSD-PBEP86 def2-TZVP D3BJ RIJCOSX verytightscf def2-TZVP/C def2/J soscf noTRAH
formula: C8H13
InChI: InChI=1/C8H13/c1-2-4-6-8-7-5-3-1/h1-2,7H,3-6,8H2
21 atoms
C  -1.988532 0.663241 0.110941
H  -2.168471 0.854789 1.173318
C  -1.835891 -0.938783 -0.127519
H  -2.647463 -1.438467 0.404418
C  -0.460823 -1.338623 0.387067
C  0.682251 -1.267434 -0.373005
C  1.9903 -0.663297 0.099357
H  2.174522 -0.864584 1.159207
H  2.847697 -1.011216 -0.479604
C  1.837088 0.939035 -0.125473
H  1.934257 1.161892 -1.192754
H  2.647828 1.436986 0.409406
C  0.460952 1.329959 0.395301
C  -0.685187 1.275282 -0.361827
H  0.544876 -1.258348 -1.457886
H  -1.935697 -1.15181 -1.196538
H  0.001485 0.000414 0.069903
H  -0.553743 1.284371 -1.447328
H  -2.849771 1.013061 -0.461097
H  0.348686 1.328201 1.482457
H  -0.346488 -1.354411 1.473981
totalener: -311.07809696 hartree
nucrepener: 382.88822139 hartree
electener: -693.96631835 hartree
oneelecener: -1165.66897784 hartree
twoeener: 471.70265950 hartree
kineticenergy: 309.95227046 hartree
exchangeener: -13.663437296552 hartree
correlationener: -0.928082938384 hartree
xcener: -14.591520234936 hartree
chargesum: 1.0000000
charge: -0.227476 0.166241 -0.238760 0.181868 -0.106713 -0.071750 -0.228396 0.166065 0.180370 -0.240043 0.166769 0.181765 -0.103767 -0.074172 0.167835 0.166910 0.214766 0.168248 0.180469 0.174881 0.174889
charge: -0.193725 0.150891 -0.193017 0.153897 -0.118051 -0.092475 -0.193839 0.150781 0.154062 -0.193108 0.150480 0.153803 -0.119414 -0.090583 0.163507 0.150559 0.322638 0.163407 0.154146 0.163121 0.162921
qa: -0.2275 0.1662 -0.2388 0.1819 -0.1067 -0.0717 -0.2284 0.1661 0.1804 -0.2400 0.1668 0.1818 -0.1038 -0.0742 0.1678 0.1669 0.2148 0.1682 0.1805 0.1749 0.1749
va: 3.8880 0.9703 3.9042 0.9673 3.8379 3.8542 3.8897 0.9702 0.9676 3.9060 0.9696 0.9674 3.8310 3.8607 0.9648 0.9696 0.9897 0.9644 0.9675 0.9642 0.9640
total: -311.763114983 hartree
dispcorr: -0.012001346 hartree
energy: -311.775116329140
dipole: -0.00210 -0.00259 -0.00468 0.00156 0.00065 0.00220 -0.05811 0.03989 -0.01822
magnitude: 0.01894 au
magnitude: 0.04814 debye
