program: Gaussian 09
title: 000051165
version: EM64L-G09RevD.01
frameworkgroup: C1[X(C10H12O3)]
method: RPBEPBE
basis: SDD
operation: Freq
keyword: #pfreq=noraman
keyword: PBEPBE/SDD
title: #p freq=noraman PBEPBE/SDD
converged: YES YES NO NO
title: Mulliken charges:
elementType: O O O C C C C C C C C C C H H H H H H H H H H H H
charge: -0.290852 -0.439724 -0.263988 -0.001352 -0.374366 -0.278359 0.436544 -0.420014 -0.383278 -0.345160 -0.345124 0.320000 -0.537901 0.251049 0.215124 0.223715 0.208181 0.235352 0.262569 0.341661 0.252457 0.241768 0.222513 0.222006 0.247180
chargesum: 0.00000
title: Mulliken charges with hydrogens summed into heavy atoms:
elementType: O O O C C C C C C C C C C
charge: -0.290852 -0.098062 -0.263988 0.249697 0.064472 -0.070178 0.436544 -0.184661 -0.120709 -0.092703 -0.103356 0.320000 0.153797
polarizability: 1.62900753e+02 1.26084218e+00 1.02634078e+02 7.24884794e+00 -1.22735005e+01 8.56377931e+01
1716.lowfreq: -8.4598 0.0005 0.0006 0.0007 3.6446 10.9900 38.2534 47.9634 74.8100
frequency: 38.0487 47.9471 74.7970 108.4857 150.2133 171.5490 233.4023 249.8082 268.8939 299.3424 313.7837 353.0516 399.0571 415.9260 458.2245 498.4367 542.6738 558.0733 628.8695 721.3367 737.8298 765.5290 807.8048 817.8981 830.8713 837.8978 885.6778 944.0952 960.2579 971.7306 987.1462 1002.1022 1018.6924 1053.9728 1100.0771 1110.3504 1112.0216 1122.5626 1156.2230 1174.2168 1199.0384 1221.0031 1231.0908 1242.0241 1279.1796 1308.3899 1312.0745 1385.6279 1407.0126 1418.2618 1436.3167 1468.6810 1473.3988 1484.3018 1499.5112 1583.8427 1620.3252 2961.4439 2963.0305 3050.0524 3062.1827 3105.5123 3120.9411 3127.3633 3137.4906 3162.6743 3167.4039 3168.1674 3556.8792
redmass: 3.8163 4.8187 3.8395 3.7983 4.6734 4.0376 1.7334 2.7048 1.8326 7.3249 1.4350 2.5247 4.3954 2.9566 4.0084 3.9915 3.1067 4.6920 7.0392 5.1481 4.4917 5.6964 2.3783 1.3548 1.8375 3.2171 2.0365 1.4110 1.4040 3.4705 8.2839 2.5677 1.3098 1.7729 1.3157 1.3291 1.2643 1.3018 1.3389 1.2269 2.0345 1.3428 3.5720 1.4673 1.5389 1.5113 1.3546 4.4103 1.9984 3.3150 1.1766 1.0503 1.0774 1.2236 2.4469 7.1345 6.3910 1.0332 1.0846 1.1040 1.0533 1.0909 1.0897 1.0994 1.0882 1.0949 1.1180 1.0952 1.0660
irintensity: 1.9194 0.8469 4.5236 8.5279 1.7021 3.9322 8.6159 5.7286 7.5675 3.6835 103.9893 67.1501 9.8385 0.4905 7.5523 17.7666 18.3082 25.2665 1.5088 15.4642 7.8262 15.4169 65.7837 11.5174 34.8101 23.6622 18.6489 4.3729 3.0049 70.6818 39.2649 4.3763 10.0576 11.3506 6.8968 5.3643 0.8130 32.3338 0.9693 54.2864 3.0594 11.4282 185.5371 4.7136 32.2595 34.6047 8.1839 11.6466 0.2351 1.5733 9.5086 13.8090 54.1215 4.6999 85.7749 8.2506 71.5812 69.9509 26.7067 47.7243 24.6401 8.6325 14.0954 25.3124 4.3889 11.9446 30.7119 4.9244 6.8649
temp: 298.150 k
press: 1.00000 atm
elementType: 8 8 8 6 6 6 6 6 6 6 6 6 6 1 1 1 1 1 1 1 1 1 1 1 1
symmnumber: 1
zpe: 520866.6 jmol-1
zpe.correction: 0.198388 hartree
zpe.thermalcorrener: 0.211112 hartree
zpe.thermalcorrenthalpy: 0.212056 hartree
zpe.thermalcorrgfe: 0.158512 hartree
zpe.sumelectzpe: -612.882773 hartree
zpe.sumelectthermal: -612.870048 hartree
zpe.sumelectthermalent: -612.869104 hartree
zpe.sumelectthermalfe: -612.922648 hartree
dipole: -4.7089 -0.1092 -0.6421
dipole: 4.7537
quadrupole: -89.0147 -73.4871 -70.3956
quadrupole: -10.0197 5.6465 -1.2645
quadrupole: -11.3822 4.1454 7.2369 -10.0197 5.6465 -1.2645
hfenergy: -613.0811601 hartree
pointgroup: C01 [X(C10H12O3)]
dipole: 1.8424606 0.116152 0.2995042 debye
dipolederiv: -0.9137101 0.0015231 -0.0051791 -0.0191092 -0.2621488 -0.0282836 0.0185734 -0.0377677 -0.3637938 -0.6261449 -0.017121 -0.2537872 0.0428231 -0.5463995 0.248523 -0.2946841 0.2362556 -0.5369599 -1.7389801 -0.2258736 -0.3063167 -0.0913128 -0.3364122 -0.0277847 -0.3173976 -0.0549546 -0.367333 0.4127552 0.042626 -0.1003505 0.0110746 0.2015465 0.0661071 -0.1749858 0.0934747 0.1780509 0.1598554 -0.1225932 0.0607219 -0.0096885 0.1724031 0.0686196 -0.074475 0.0480624 0.2548009 0.5471801 0.0143079 0.1198163 -0.0127381 0.4397592 -0.2333813 0.2170755 -0.2439574 0.5315608 -0.0907813 -0.0086299 -0.0736782 -0.0061145 -0.2321688 0.0442155 -0.0273833 0.0207656 -0.2032831 0.1222777 -0.0521931 0.0519803 -0.047657 0.1130446 0.0539554 0.0372352 0.036144 -0.1337995 0.0833937 0.0628297 0.0735509 -0.0254812 0.0894012 0.0380161 0.0937384 0.0627996 -0.1063824 -0.3793202 -0.0150165 -0.0431461 -0.2803545 0.034544 -0.0120994 -0.0964673 0.0334333 -0.1685061 -0.344451 -0.0325355 -0.0262731 0.3278515 -0.0209742 0.0906785 0.0198577 0.0233652 -0.1841985 1.5526459 0.0669022 0.2894984 -0.1949658 0.0199235 -0.0451426 0.2678187 -0.001097 0.1483417 0.6077041 0.1497627 0.0806074 0.4865374 0.3991014 0.1042443 0.1610097 0.0477208 0.3624728 0.0381365 -0.0647817 0.0363777 -0.0482353 -0.0568741 -0.078467 0.0418211 -0.0401486 0.0438261 0.0977548 0.1070726 -0.0183352 0.0981495 -0.0835655 -0.016128 0.000952 -0.0679956 0.0253273 0.0872198 0.0361017 0.0069508 0.0231755 0.0666374 -0.0116528 0.0345432 0.0214475 -0.1500586 -0.0033773 -0.0096275 -0.0202045 -0.0721738 -0.1654328 -0.0411204 -0.0075812 -0.0281588 -0.008268 0.0225083 -0.1046333 -0.054268 -0.0811671 -0.0235833 -0.0505923 -0.0477619 -0.0493104 0.1171485 0.0658187 0.0768816 -0.0026541 0.0768847 -0.0153559 -0.0252528 0.0070646 -0.0193033 0.1377467 0.2700193 0.0180663 0.213828 0.0311627 0.2532201 -0.039235 0.2447718 -0.0316909 0.1734666 0.0482103 0.0770926 -0.0065931 0.0785371 -0.0149173 -0.0248519 -0.0100341 -0.0245521 0.1621192 0.0217427 -0.0837033 -0.0430648 -0.0943988 -0.0145409 -0.0536484 -0.0558147 -0.0492273 0.1425945 0.0370865 0.0338284 0.103682 -0.1153713 -0.0037898 -0.1096714 0.00268 -0.0887536 -0.1126223 0.0646081 0.0176507 -0.0364937 -0.1559477 -0.0874792 0.077244 -0.0008152 0.1172322 -0.0575874 -0.1421523 0.0320631 -0.0466693 0.0785194 0.0740612 0.0057081 -0.0397411 -0.0037834 0.1153364 unknown
polarizability: 162.2942547|3.2872607|109.161131|9.4490005|1.2638171|79.7172385 unknown
InChI: InChI=1S/C10H12O3/c1-12-8-4-2-7(3-5-8)10(11)9-6-13-9/h2-5,9-11H,6H2,1H3
charge 0 multiplicity 1
25 atoms
O  -4.148141 -0.27695 0.558887
O  -2.270893 1.286739 -1.529103
O  3.698545 -0.435507 0.339791
C  -2.738709 0.261267 0.561031
C  -3.08092 -0.915424 1.416138
C  -1.943668 0.093628 -0.723722
C  -0.446583 -0.015478 -0.452694
C  0.226061 -1.259595 -0.571598
C  0.299308 1.122857 -0.061926
C  1.601824 -1.368972 -0.299924
C  1.681339 1.032429 0.213571
C  2.334192 -0.221348 0.096558
C  4.504579 0.718199 0.747697
H  -2.641803 1.251814 1.025058
H  -2.774597 -1.920765 1.097906
H  -3.20543 -0.778366 2.496949
H  -2.300675 -0.829087 -1.229976
H  -0.330795 -2.151093 -0.886519
H  -0.206995 2.09196 0.011976
H  -1.711015 1.275209 -2.346992
H  2.131089 -2.322052 -0.392664
H  2.231507 1.930266 0.510833
H  4.142993 1.144302 1.7037
H  4.506468 1.504202 -0.0324
H  5.522821 0.324164 0.879125
