program: Gaussian 09
title: 000051178
version: EM64L-G09RevD.01
frameworkgroup: C1[X(C15H18Cl2N2O)]
method: RPBEPBE
basis: SDD
operation: Freq
keyword: #p
keyword: freq=noraman
keyword: PBEPBE/SDD
title: #p freq=noraman PBEPBE/SDD
converged: YES YES NO NO
title: Mulliken charges:
elementType: Cl Cl O N N C C C C C C C C C C C C C C C H H H H H H H H H H H H H H H H H H
charge: -0.029564 -0.008896 -0.278020 -0.082671 -0.103815 -0.085450 -0.082999 -0.490439 -0.428322 -0.403066 -0.427544 -0.426484 -0.613023 0.128356 0.293697 -0.310104 -0.400871 -0.077242 -0.201674 -0.116246 0.208850 0.210331 0.218081 0.223876 0.190130 0.225426 0.221316 0.183286 0.246774 0.228824 0.218111 0.262344 0.227093 0.193562 0.229842 0.327348 0.269383 0.259800
chargesum: 0.00000
title: Mulliken charges with hydrogens summed into heavy atoms:
elementType: Cl Cl O N N C C C C C C C C C C C C C C C
charge: -0.029564 -0.008896 -0.278020 -0.082671 -0.103815 0.123400 0.127333 -0.048482 -0.012766 0.001536 0.048054 0.053971 0.037474 0.128356 0.293697 0.017244 -0.131488 -0.077242 0.058126 -0.116246
polarizability: 2.53386316e+02 5.82914590e+00 1.98438694e+02 3.21202888e+00 4.85883860e+00 1.31960475e+02
1716.lowfreq: -14.9514 -11.9766 -4.5217 -0.0015 -0.0012 0.0017 32.0482 35.6955 46.2472
frequency: 31.3402 35.5096 46.1077 67.5083 101.2174 127.3919 155.9695 159.4268 183.1775 211.4707 243.3779 245.0901 282.9935 295.4222 303.5968 322.9102 336.6397 342.7512 360.5887 381.2114 398.9026 413.9443 422.3588 454.0279 476.3450 493.9864 514.0658 591.6142 641.8114 655.6430 668.2771 686.5116 732.9112 737.9759 779.1131 803.9295 809.5339 833.2900 887.4999 899.4751 915.5633 922.9298 954.5085 961.3322 967.3889 979.0838 986.1917 990.5428 1007.7062 1054.6930 1070.3017 1098.8426 1107.4481 1119.5097 1120.9321 1127.0022 1130.3508 1138.8242 1148.8535 1160.7176 1199.9401 1238.0154 1249.6977 1257.4128 1262.1637 1270.3923 1295.2865 1318.2476 1326.8464 1329.6339 1337.8641 1354.0297 1356.8118 1362.9098 1368.8425 1376.8889 1380.7556 1409.4475 1435.3599 1458.8768 1461.1753 1466.1395 1467.0958 1475.0883 1478.8249 1484.9205 1488.8844 1546.0874 1564.8055 1592.3160 2814.4993 2825.7694 2864.0188 2929.2714 2948.2763 2974.4245 2994.8676 3003.3847 3009.0153 3014.9001 3018.6696 3036.7094 3075.2701 3077.4735 3087.6051 3114.4979 3157.3450 3176.4366
redmass: 5.1952 9.1979 6.0559 6.0883 5.3643 2.9002 7.1403 3.3945 23.8782 4.9789 1.3892 3.1903 4.2143 5.1632 3.2739 2.1309 3.4370 5.2774 2.6104 2.1038 2.8781 6.2125 2.7812 3.2123 4.1069 6.3559 3.0877 5.4550 6.2181 6.7346 4.8112 6.5693 4.2727 4.6027 5.6191 3.5656 2.6993 1.4739 2.8693 1.6218 1.6026 2.5712 1.3981 1.9448 1.3672 1.9126 2.8753 2.9174 5.0169 1.6597 2.0704 1.2651 1.5621 1.6422 2.1287 1.5579 1.4716 1.5026 2.3129 1.8731 1.1426 1.7459 1.9189 1.3745 1.5471 2.0500 1.6847 2.1190 1.3699 1.4627 1.7574 1.4075 4.5277 1.3821 1.3646 1.5026 3.3684 2.7463 1.1750 2.4048 1.1222 1.0956 1.0730 1.1117 1.0835 1.0746 1.0871 8.8445 8.0970 6.5943 1.0717 1.0704 1.0559 1.0718 1.0698 1.0616 1.0866 1.0849 1.0853 1.0872 1.0741 1.1031 1.0918 1.1010 1.0893 1.0944 1.0885 1.0974
irintensity: 0.2698 0.9458 0.7837 2.3094 1.2020 1.4373 1.2552 1.4028 0.2382 0.7241 0.1117 1.2202 3.1695 1.1342 14.7999 1.5819 6.3008 0.7786 1.2184 1.4063 0.1800 4.1906 2.3178 5.2871 0.7744 34.8343 6.8352 7.1144 5.0317 18.7712 0.7362 5.0471 16.3198 12.2969 2.0134 20.5000 0.2419 33.3414 6.8234 16.4455 1.2313 3.7081 9.7384 0.2383 9.3297 9.3600 30.5499 11.9313 33.7730 10.5489 29.4991 0.0428 15.0088 16.5065 20.1865 12.5051 4.2026 3.7757 26.0627 7.8119 0.4128 54.3898 92.3695 2.1634 18.8944 6.1365 10.3179 48.0810 1.7420 1.7418 20.8787 2.9452 3.1481 2.1430 4.6585 2.1452 8.7790 176.7094 1.2164 23.3956 24.0579 12.0350 7.2830 8.0768 19.9547 17.3284 5.6722 222.9777 54.0866 14.7981 57.3045 160.0341 210.5733 47.5647 59.2475 31.0239 30.6279 82.3849 93.6357 18.1398 26.1074 42.7994 5.7518 26.0269 12.9483 59.8828 0.5348 3.3664
temp: 298.150 k
press: 1.00000 atm
elementType: 17 17 8 7 7 6 6 6 6 6 6 6 6 6 6 6 6 6 6 6 1 1 1 1 1 1 1 1 1 1 1 1 1 1 1 1 1 1
symmnumber: 1
zpe: 800510.1 jmol-1
zpe.correction: 0.304898 hartree
zpe.thermalcorrener: 0.323039 hartree
zpe.thermalcorrenthalpy: 0.323983 hartree
zpe.thermalcorrgfe: 0.257952 hartree
zpe.sumelectzpe: -1685.743749 hartree
zpe.sumelectthermal: -1685.725608 hartree
zpe.sumelectthermalent: -1685.724664 hartree
zpe.sumelectthermalfe: -1685.790695 hartree
dipole: -4.3007 1.4450 2.8574
dipole: 5.3618
quadrupole: -125.8850 -135.8217 -133.6019
quadrupole: -9.5932 -2.1298 -8.5510
quadrupole: 5.8845 -4.0522 -1.8323 -9.5932 -2.1298 -8.5510
hfenergy: -1686.0486467 hartree
pointgroup: C01 [X(C15H18Cl2N2O1)]
dipole: -1.7291474 0.209191 1.1900515 debye
polarizability: 250.5024978|13.777401|200.0177545|0.6742532|10.7969315|133.265232 unknown
InChI: InChI=1S/C15H18Cl2N2O/c1-18-6-10-4-11(7-18)9-19(8-10)15(20)12-2-3-13(16)14(17)5-12/h2-3,5,10-11H,4,6-9H2,1H3
charge 0 multiplicity 1
38 atoms
Cl 2.470793 2.89518 0.130417
Cl 5.275504 1.169036 0.324132
O  -0.146471 -2.469849 -1.591776
N  -2.066027 1.417345 -0.385153
N  -1.206481 -1.359823 0.165179
C  -2.279348 0.243966 1.816551
C  -3.573104 -0.614389 -0.122433
C  -3.656572 -0.321435 1.394264
C  -2.05475 1.587807 1.086378
C  -3.271287 0.701776 -0.884177
C  -1.182527 -0.822456 1.545804
C  -2.534295 -1.738019 -0.363708
C  -1.853366 2.693661 -1.097308
C  -0.086711 -1.681038 -0.589456
C  1.216191 -0.993013 -0.26177
C  1.24835 0.418858 -0.155868
C  2.425415 -1.727522 -0.22692
C  2.477198 1.080824 0.014557
C  3.653271 -1.06113 -0.03909
C  3.679603 0.345705 0.08589
H  -2.26892 0.444757 2.906076
H  -4.5479 -0.990878 -0.490664
H  -3.894287 -1.246519 1.955174
H  -4.456547 0.412771 1.61091
H  -2.850878 2.303575 1.426107
H  -1.081804 2.031165 1.377933
H  -3.119043 0.490482 -1.960106
H  -4.180451 1.356288 -0.801653
H  -0.182254 -0.417865 1.763032
H  -1.355533 -1.666464 2.250675
H  -2.892404 -2.668948 0.127209
H  -2.407922 -1.963437 -1.435495
H  -0.909192 3.159706 -0.760484
H  -2.680211 3.429772 -0.931144
H  -1.7746 2.506221 -2.182873
H  0.309267 0.976696 -0.255092
H  2.400426 -2.812652 -0.363903
H  4.593566 -1.618355 0.003183
