program: Orca
programVersion: 5.0.3
elementType: C H C H C C C H H C H H C C H H H H H H H
charge: 1
multiplicity: 1
keywords: DSD-PBEP86 cc-pVTZ EnGrad RIJCOSX verytightscf cc-pVTZ/C def2/J soscf
formula: C8H13
InChI: InChI=1/C8H13/c1-2-4-6-8-7-5-3-1/h1-2,7H,3-6,8H2
21 atoms
C  -1.99451 0.517582 0.087598
H  -2.189923 0.763012 1.134798
C  -1.998643 -1.019236 -0.135973
H  -2.683229 -1.590202 0.492009
C  -0.54391 -1.087274 0.283739
C  0.579305 -1.064434 -0.524473
C  1.901018 -0.629277 0.031275
H  2.009346 -0.981426 1.062782
H  2.726904 -1.033987 -0.559314
C  1.934334 0.937602 0.008045
H  2.127688 1.280625 -1.014591
H  2.754668 1.300314 0.632796
C  0.570538 1.471941 0.485262
C  -0.497134 0.711295 -0.255389
H  0.485203 -1.270741 -1.589745
H  -2.147681 -1.286969 -1.185659
H  0.445422 1.379775 1.569502
H  -0.38151 0.801875 -1.338879
H  -2.655984 1.102567 -0.556763
H  0.472509 2.537071 0.233981
H  -0.373995 -1.036985 1.359903
totalener: -311.18255731 hartree
nucrepener: 387.46907403 hartree
electener: -698.65163135 hartree
oneelecener: -1175.10724027 hartree
twoeener: 476.45560893 hartree
kineticenergy: 309.75531892 hartree
exchangeener: -12.764282957290 hartree
correlationener: -0.949869862140 hartree
xcener: -13.714152819430 hartree
chargesum: 1.0000000
charge: -0.214176 0.170449 -0.245816 0.186457 -0.040331 -0.042598 -0.255157 0.167078 0.184107 -0.252249 0.164493 0.181892 -0.240130 -0.098130 0.226610 0.171455 0.160800 0.195018 0.184010 0.192734 0.203486
charge: 0.108928 0.000124 0.109078 -0.000446 0.123967 0.182076 0.085787 0.002845 0.006777 0.096111 -0.006063 0.000102 0.066307 0.185558 0.006463 -0.000137 -0.003347 0.005009 -0.001869 0.016169 0.016560
qa: -0.2142 0.1704 -0.2458 0.1865 -0.0403 -0.0426 -0.2552 0.1671 0.1841 -0.2522 0.1645 0.1819 -0.2401 -0.0981 0.2266 0.1715 0.1608 0.1950 0.1840 0.1927 0.2035
va: 3.8666 0.9853 3.8892 0.9767 3.7835 3.7660 3.9225 0.9820 0.9761 3.8955 0.9802 0.9733 3.8934 3.7774 0.9589 0.9846 0.9844 0.9818 0.9743 0.9679 0.9768
energy: -311.886698844749
dipole: 0.55236 -0.70238 -0.15002 1.83929 -1.94505 -0.10576 0.22554 -0.39463 -0.16910
magnitude: 0.24957 au
magnitude: 0.63436 debye
