program: Orca
programVersion: 5.0.3
elementType: C H C H C C C H H C H H C C H H H H H H H
charge: 1
multiplicity: 1
keywords: DSD-PBEP86 cc-pVTZ EnGrad D3BJ RIJCOSX verytightscf cc-pVTZ/C def2/J soscf
formula: C8H13
InChI: InChI=1/C8H13/c1-2-4-6-8-7-5-3-1/h1-2,7H,3-6,8H2
21 atoms
C  -1.999455 0.522228 0.115178
H  -2.181722 0.726231 1.173673
C  -1.980634 -1.006446 -0.163189
H  -2.678893 -1.602165 0.425957
C  -0.533323 -1.101191 0.274785
C  0.600479 -1.094806 -0.513122
C  1.904425 -0.640537 0.05714
H  1.998372 -0.955452 1.101847
H  2.749549 -1.045787 -0.505489
C  1.91509 0.926226 -0.021131
H  2.069005 1.233668 -1.061901
H  2.753908 1.319054 0.559361
C  0.566771 1.477881 0.483278
C  -0.522685 0.753976 -0.250775
H  0.521358 -1.286613 -1.582646
H  -2.109626 -1.230853 -1.225802
H  0.454952 1.380423 1.568323
H  -0.409457 0.828807 -1.335573
H  -2.687564 1.113198 -0.496069
H  0.49254 2.54825 0.240466
H  -0.378991 -1.053383 1.353654
totalener: -311.15337650 hartree
nucrepener: 386.75097793 hartree
electener: -697.90435443 hartree
oneelecener: -1173.69506479 hartree
twoeener: 475.79071036 hartree
kineticenergy: 309.75375620 hartree
exchangeener: -13.674228308917 hartree
correlationener: -0.927454198882 hartree
xcener: -14.601682507799 hartree
chargesum: 1.0000000
charge: -0.212168 0.167008 -0.239193 0.184141 -0.051499 -0.045519 -0.250697 0.164563 0.183422 -0.248565 0.161094 0.181301 -0.233910 -0.085058 0.225212 0.168040 0.160855 0.196137 0.182274 0.192983 0.199578
charge: 0.103888 -0.000484 0.106560 -0.001052 0.121622 0.180320 0.085096 0.002112 0.006828 0.097545 -0.006324 -0.000088 0.065957 0.202208 0.004817 -0.000583 -0.002638 0.003110 -0.001119 0.018899 0.013326
qa: -0.2122 0.1670 -0.2392 0.1841 -0.0515 -0.0455 -0.2507 0.1646 0.1834 -0.2486 0.1611 0.1813 -0.2339 -0.0851 0.2252 0.1680 0.1609 0.1961 0.1823 0.1930 0.1996
va: 3.8659 0.9865 3.8871 0.9770 3.7941 3.7722 3.9214 0.9836 0.9764 3.8936 0.9813 0.9732 3.8951 3.7604 0.9597 0.9861 0.9848 0.9804 0.9749 0.9685 0.9784
dispcorr: -0.011485397 hartree
energy: -311.858930458148
dipole: 0.55611 -0.68835 -0.13224 1.84908 -1.88826 -0.03918 0.20209 -0.36845 -0.16636
magnitude: 0.21610 au
magnitude: 0.54928 debye
