program: Orca
programVersion: 5.0.3
elementType: C H C H C C C H H C H H C C H H H H H H H
charge: 1
multiplicity: 1
keywords: b3lyp cc-pVTZ EnGrad RIJCOSX verytightscf cc-pVTZ/C def2/J soscf
formula: C8H13
InChI: InChI=1/C8H13/c1-2-4-6-8-7-5-3-1/h1-2,7H,3-6,8H2
21 atoms
C  -2.002717 0.744077 0.069481
H  -2.167802 0.809346 1.147753
C  -1.733182 -0.975546 -0.166484
H  -2.620441 -1.34225 0.354349
C  -0.410888 -1.384523 0.386767
C  0.680727 -1.270444 -0.389007
C  1.995059 -0.700822 0.0632
H  2.19762 -0.912035 1.118581
H  2.852434 -1.037433 -0.526499
C  1.788498 0.838158 -0.131724
H  1.821687 1.102057 -1.194649
H  2.594062 1.388677 0.361401
C  0.427057 1.29626 0.497062
C  -0.764784 1.288848 -0.355625
H  0.516322 -1.189324 -1.46816
H  -1.828684 -1.136641 -1.241134
H  0.224829 0.768347 1.432108
H  -0.658745 1.63631 -1.387205
H  -2.880483 0.99784 -0.52374
H  0.518051 2.369713 0.777047
H  -0.323989 -1.469334 1.469187
totalener: -312.21286486 hartree
nucrepener: 379.11754861 hartree
electener: -691.33041347 hartree
oneelecener: -1159.30161580 hartree
twoeener: 467.97120233 hartree
kineticenergy: 309.98912687 hartree
exchangeener: -36.297008555760 hartree
correlationener: -2.303238350360 hartree
xcener: -38.600246906120 hartree
chargesum: 1.0000000
charge: -0.199996 0.170322 -0.183914 0.172510 -0.128263 -0.091818 -0.169225 0.127744 0.145267 -0.197890 0.130698 0.149901 -0.173025 0.103903 0.132399 0.162277 0.135770 0.205710 0.174143 0.184645 0.148839
charge: 0.135139 0.012337 0.174923 0.004425 0.025273 0.066508 0.075742 -0.004927 -0.002851 0.110231 -0.011764 -0.001718 0.085390 0.302839 -0.018381 -0.002829 0.005417 0.016891 0.004247 0.047867 -0.024757
qa: -0.2000 0.1703 -0.1839 0.1725 -0.1283 -0.0918 -0.1692 0.1277 0.1453 -0.1979 0.1307 0.1499 -0.1730 0.1039 0.1324 0.1623 0.1358 0.2057 0.1741 0.1846 0.1488
va: 3.8282 0.9814 3.8488 0.9731 3.7805 3.8059 3.8546 0.9934 0.9840 3.8412 0.9901 0.9803 3.8528 3.5370 0.9940 0.9816 1.0038 0.9694 0.9818 0.9731 0.9945
energy: -312.212864858213
dipole: 0.22929 -1.06034 -0.83104 1.85902 -0.67648 1.18254 0.29872 -0.42770 -0.12898
magnitude: 1.45109 au
magnitude: 3.68839 debye
