program: Gaussian 09
title: 000051204
version: EM64L-G09RevD.01
frameworkgroup: C1[X(C18H26N2O)]
method: RPBEPBE
basis: SDD
operation: Freq
keyword: #p
keyword: freq=noraman
keyword: PBEPBE/SDD
title: #p freq=noraman PBEPBE/SDD
converged: YES YES NO NO
title: Mulliken charges:
elementType: O N N C C C C C C C C C C C C C C C C C C H H H H H H H H H H H H H H H H H H H H H H H H H H
charge: -0.270161 -0.459200 -0.098608 -0.186679 -0.443250 -0.444160 -0.400159 -0.399415 -0.382545 0.353125 0.163782 -0.379978 -0.063059 -0.370531 -0.515909 -0.265686 0.253600 -0.274718 -0.510466 -0.248017 -0.702903 0.264213 0.213904 0.187938 0.190969 0.212098 0.201576 0.195038 0.193744 0.199165 0.184398 0.197179 0.230888 0.231656 0.241133 0.262162 0.205724 0.218909 0.189168 0.221553 0.222772 0.222108 0.276720 0.221737 0.209288 0.219632 0.231266
chargesum: 0.00000
title: Mulliken charges with hydrogens summed into heavy atoms:
elementType: O N N C C C C C C C C C C C C C C C C C C
charge: -0.270161 -0.182480 -0.098608 0.077534 -0.041407 -0.041094 -0.003545 -0.006507 -0.000969 0.353125 0.163782 -0.149090 0.168596 -0.129398 -0.048023 0.142391 0.253600 -0.052610 -0.066141 -0.026280 -0.042716
polarizability: 2.15293808e+02 7.21874434e+00 2.35370578e+02 1.08653717e+01 5.36145596e+00 1.63406652e+02
1716.lowfreq: -26.2441 -8.3142 -4.9623 -0.0002 0.0006 0.0007 3.1259 14.0320 20.8140
frequency: -24.2340 12.8302 17.3780 23.7077 59.5480 61.3472 82.3202 95.8437 121.2738 193.2246 196.1107 205.8769 215.8762 219.3241 240.2703 249.9213 285.3232 308.4752 322.5583 329.8595 359.7054 410.8874 415.1638 428.0576 454.6153 479.1998 482.9118 502.0610 558.2772 580.9888 598.1700 617.2775 667.7635 710.4698 742.8674 748.0673 752.8393 771.0239 780.9162 824.2035 825.7675 844.7858 856.8851 884.9845 891.6445 896.1363 903.1267 911.1392 914.3632 931.1361 934.2492 950.2903 967.7541 990.2177 1000.8062 1012.6163 1045.9844 1047.9934 1054.5720 1054.6739 1067.6701 1078.7783 1088.2640 1099.8353 1112.1333 1114.1536 1139.9347 1172.2959 1178.0412 1179.2373 1185.6748 1199.5739 1218.7026 1226.8101 1234.7117 1242.7370 1256.7468 1260.0791 1272.1404 1280.2994 1292.8655 1305.9292 1309.5694 1332.5719 1336.8714 1338.1089 1340.2189 1343.1002 1345.9264 1351.0830 1374.4279 1382.4819 1394.0314 1436.9723 1437.6322 1445.8687 1456.4981 1457.9886 1459.5751 1462.1473 1466.7096 1470.8203 1471.7137 1472.9484 1475.1673 1489.0475 1592.2235 1602.7419 1605.8236 2942.6830 2959.5873 2960.2890 2961.8133 2963.5526 2967.0985 2973.1719 2985.5738 2989.9310 3001.8184 3003.8110 3010.9114 3020.2081 3023.6527 3030.0279 3030.6308 3044.0203 3044.7875 3068.7978 3082.7147 3094.3996 3118.6508 3130.6139 3149.6104 3164.3764 3591.4363
redmass: 2.9065 4.2579 3.7875 3.6089 4.1689 3.7348 4.0778 4.5300 3.3243 3.1530 2.7234 3.5006 2.3414 2.1678 1.1346 3.3435 1.4459 1.9228 3.6422 1.8666 2.0288 2.6014 3.0200 2.9927 3.3276 3.1132 1.8793 3.0848 3.7629 4.4041 5.4105 4.2543 2.7605 3.3857 2.6567 2.8966 1.5755 2.9053 1.4693 3.5524 3.4953 1.4677 1.6082 2.7053 1.5320 2.7762 2.2798 1.7987 1.7497 1.5431 2.7900 3.0717 1.3217 2.4898 2.0854 2.9312 1.9520 1.8949 1.5828 1.6609 1.2436 2.2987 2.4542 1.7377 2.4141 1.9643 2.2638 1.0882 1.2419 1.4955 1.8730 1.2644 2.7336 1.2789 1.4139 1.3453 1.2869 1.3265 1.5471 1.5566 1.3425 1.3242 1.3604 1.3686 1.3368 1.4274 1.5233 1.3521 1.5547 1.5681 1.3399 1.2218 3.7759 2.1906 1.7957 1.3468 1.0901 1.0966 1.0898 1.0963 1.1046 1.1232 1.2174 1.0728 1.1855 1.5855 6.8056 6.4180 6.7411 1.0559 1.0613 1.0620 1.0614 1.0633 1.0641 1.0354 1.0690 1.0712 1.1013 1.0788 1.0860 1.0973 1.0942 1.1028 1.1005 1.1009 1.1045 1.0991 1.1005 1.0938 1.0862 1.0886 1.0932 1.0995 1.0797
irintensity: 0.0320 0.4208 3.4102 4.8430 0.4277 1.0346 0.5002 3.2714 0.4995 8.3303 3.6084 0.1938 0.5673 0.2091 2.0779 11.7005 114.1627 44.6201 1.6653 3.1978 7.9659 1.7868 2.6001 0.4629 3.4771 6.4736 0.8217 2.3259 0.2650 1.2526 5.2728 3.4851 0.7413 1.2386 13.0194 15.8281 69.0667 3.3447 0.0292 2.0398 2.8212 0.2266 5.2654 12.7644 14.9363 7.6124 5.2952 12.9323 0.1177 0.0664 8.2755 5.8771 0.1271 20.1730 12.8569 36.4634 16.0021 5.2776 3.2801 3.8077 0.0589 2.1944 32.0732 3.7525 0.0174 12.6412 21.1528 10.6120 11.7496 1.4088 24.2366 4.1139 190.1287 14.5085 6.8895 19.0199 3.0490 6.3295 27.5002 7.4532 7.3942 0.5672 9.8622 0.0853 12.1294 0.4031 1.4836 0.5431 3.2184 6.0505 15.1765 17.6960 17.8401 24.9394 105.7714 32.9125 1.0496 6.2235 7.9264 6.3213 5.4074 34.3312 31.4079 4.2116 34.7150 20.4848 6.0086 49.5860 61.9852 47.7577 19.1665 34.0736 62.6876 16.7019 24.4653 29.7369 29.2823 25.5277 70.1208 38.9645 24.6310 93.5343 71.6186 9.2936 9.4197 142.6316 7.2377 32.6149 40.9419 8.9458 8.4184 12.4364 37.7387 22.2585 9.7679
temp: 298.150 k
press: 1.00000 atm
elementType: 8 7 7 6 6 6 6 6 6 6 6 6 6 6 6 6 6 6 6 6 6 1 1 1 1 1 1 1 1 1 1 1 1 1 1 1 1 1 1 1 1 1 1 1 1 1 1
symmnumber: 1
zpe: 1065984.6 jmol-1
zpe.correction: 0.406012 hartree
zpe.thermalcorrener: 0.425896 hartree
zpe.thermalcorrenthalpy: 0.426840 hartree
zpe.thermalcorrgfe: 0.354912 hartree
zpe.sumelectzpe: -884.628692 hartree
zpe.sumelectthermal: -884.608808 hartree
zpe.sumelectthermalent: -884.607864 hartree
zpe.sumelectthermalfe: -884.679792 hartree
dipole: 2.0625 -2.6304 -1.9701
dipole: 3.8800
quadrupole: -117.2314 -117.7349 -129.4638
quadrupole: -8.7590 -4.7540 -5.3271
quadrupole: 4.2453 3.7418 -7.9871 -8.7590 -4.7540 -5.3271
hfenergy: -885.0347039 hartree
pointgroup: C01 [X(C18H26N2O1)]
dipole: 0.3705145 1.0797888 1.0133967 debye
polarizability: 223.1292261|-9.6590181|224.9876557|-13.4153907|13.3580099|165.9541559 unknown
InChI: InChI=1S/C18H26N2O/c1-14-13-19-18(20-14)11-12-21-17-10-6-5-9-16(17)15-7-3-2-4-8-15/h5-6,9-10,14-15,20H,2-4,7-8,11-13H2,1H3
charge 0 multiplicity 1
47 atoms
O  -0.206581 1.193537 -0.525302
N  2.9842 1.510513 0.944325
N  3.297967 0.236229 -0.944033
C  -1.273938 -1.414349 -0.329282
C  -2.089859 -2.177578 -1.41245
C  -0.872177 -2.384675 0.820673
C  -1.306428 -3.398107 -1.952374
C  -0.090389 -3.60641 0.280266
C  -0.89485 -4.355385 -0.808809
C  -2.025079 -0.193848 0.198222
C  -1.470001 1.116605 0.095316
C  -3.292789 -0.315826 0.814496
C  3.999431 0.536556 1.422871
C  -2.161858 2.250972 0.586688
C  1.850509 2.250681 -1.200641
C  0.4703 2.49147 -0.5718
C  2.726046 1.301033 -0.416872
C  -3.997064 0.804938 1.312272
C  4.051201 -0.430158 0.17591
C  -3.427329 2.090245 1.195235
C  5.355592 1.205408 1.736131
H  -0.339151 -1.061191 -0.803493
H  -2.343469 -1.486563 -2.239524
H  -3.051281 -2.523863 -0.979076
H  -1.786389 -2.735682 1.343569
H  -0.265446 -1.838127 1.568562
H  -0.393954 -3.041476 -2.473243
H  -1.915902 -3.937357 -2.703972
H  0.161608 -4.293115 1.112475
H  0.870289 -3.25837 -0.153424
H  -1.807651 -4.792884 -0.352325
H  -0.30077 -5.199443 -1.210532
H  -3.738436 -1.313379 0.907224
H  3.630287 0.008842 2.322625
H  -1.733757 3.253967 0.495917
H  1.731076 1.825315 -2.209943
H  2.354444 3.233266 -1.304518
H  -0.111299 3.204123 -1.192877
H  0.55244 2.910504 0.454009
H  5.092045 -0.632411 -0.137047
H  3.569247 -1.401482 0.396699
H  -4.977354 0.675244 1.783268
H  2.728323 2.347215 1.464844
H  -3.961193 2.969995 1.57199
H  5.26521 1.95527 2.54484
H  6.090889 0.445998 2.061625
H  5.753192 1.709152 0.836285
