program: Orca
programVersion: 5.0.3
elementType: C H C H C C C H H C H H C C H H H H H H H
charge: 1
multiplicity: 1
keywords: PBE0 cc-pVTZ EnGrad D3BJ RIJCOSX verytightscf cc-pVTZ/C def2/J soscf
formula: C8H13
InChI: InChI=1/C8H13/c1-2-4-6-8-7-5-3-1/h1-2,7H,3-6,8H2
21 atoms
C  -2.000567 0.757227 0.069293
H  -2.162329 0.822307 1.147889
C  -1.729699 -0.971864 -0.161671
H  -2.618723 -1.324606 0.365272
C  -0.413752 -1.387441 0.390696
C  0.684185 -1.273669 -0.381807
C  1.999387 -0.694991 0.062586
H  2.205512 -0.897513 1.119091
H  2.854817 -1.035586 -0.52709
C  1.787893 0.849039 -0.137131
H  1.824831 1.112061 -1.200041
H  2.591833 1.399365 0.35877
C  0.423063 1.272861 0.493611
C  -0.767278 1.296102 -0.367067
H  0.519143 -1.195811 -1.461157
H  -1.83143 -1.13101 -1.235679
H  0.203886 0.660064 1.372188
H  -0.659376 1.61696 -1.406879
H  -2.883176 0.995945 -0.522389
H  0.48859 2.306102 0.898413
H  -0.330559 -1.480526 1.472806
totalener: -312.03332693 hartree
nucrepener: 379.31511885 hartree
electener: -691.34844578 hartree
oneelecener: -1159.66069032 hartree
twoeener: 468.31224454 hartree
kineticenergy: 309.65057795 hartree
exchangeener: -34.147288027199 hartree
correlationener: -1.960287104929 hartree
xcener: -36.107575132128 hartree
chargesum: 1.0000000
charge: -0.205502 0.177448 -0.179956 0.173541 -0.148735 -0.098323 -0.171719 0.134254 0.146482 -0.199193 0.136484 0.150241 -0.199547 0.105854 0.139763 0.168421 0.144006 0.203304 0.178436 0.187623 0.157117
charge: 0.132131 0.014518 0.174950 0.007139 0.018795 0.069146 0.073023 -0.002838 -0.001769 0.105437 -0.010196 0.000085 0.078543 0.298714 -0.015185 -0.000482 0.008698 0.017334 0.005965 0.047785 -0.021792
qa: -0.2055 0.1774 -0.1800 0.1735 -0.1487 -0.0983 -0.1717 0.1343 0.1465 -0.1992 0.1365 0.1502 -0.1995 0.1059 0.1398 0.1684 0.1440 0.2033 0.1784 0.1876 0.1571
va: 3.8575 0.9812 3.8795 0.9778 3.8128 3.8328 3.8834 0.9949 0.9887 3.8699 0.9929 0.9860 3.8892 3.5727 0.9943 0.9825 1.0071 0.9742 0.9836 0.9770 0.9942
dispcorr: -0.018943710 hartree
energy: -312.052270636621
dipole: 0.19011 -1.04025 -0.85015 1.73039 -0.59731 1.13308 0.35696 -0.47717 -0.12021
magnitude: 1.42165 au
magnitude: 3.61353 debye
