program: Orca
programVersion: 5.0.3
charge: 1
multiplicity: 1
keywords: DLPNO-CCSD(T1) tightPNO Extrapolate(3/4,def2) RIJK def2/JK verytightSCF miniprint nopop
formula: C8H13
InChI: InChI=1/C8H13/c1-2-4-6-8-7-5-3-1/h1-2,7H,3-6,8H2
21 atoms
C  -1.998124 0.527817 0.119517
H  -2.176749 0.722631 1.180477
C  -1.961788 -0.999351 -0.169071
H  -2.676489 -1.593785 0.40207
C  -0.521676 -1.130024 0.279847
C  0.60821 -1.116763 -0.506095
C  1.906505 -0.649218 0.063533
H  2.004727 -0.952739 1.111208
H  2.759547 -1.045249 -0.493972
C  1.899531 0.916307 -0.032579
H  2.031601 1.212023 -1.079939
H  2.74543 1.325679 0.525865
C  0.559817 1.481004 0.488444
C  -0.542245 0.807217 -0.260442
H  0.529286 -1.2975 -1.577657
H  -2.080051 -1.211561 -1.235668
H  0.444883 1.3653 1.571132
H  -0.419135 0.872084 -1.344526
H  -2.709847 1.102581 -0.481267
H  0.516269 2.559145 0.266911
H  -0.370805 -1.079156 1.359345
e0: -310.325783792 hartree
corrType: DLPNO BASED
e0: -310.339376133 hartree
basis: def2-TZVPP def2-QZVPP
scfener: -310.325783792 -310.339376133
corrmethod: MDCI MDCI
correner: -1.452369289 -1.522495811
corrcbsextra: -1.574441344
energy: -311.915689668432
dipole: 0.56102 -0.76673 -0.20571 1.85290 -1.76051 0.09239 0.19100 -0.39666 -0.20566
magnitude: 0.30520 au
magnitude: 0.77575 debye
