program: Orca
programVersion: 5.0.3
elementType: C H C H C C C H H C H H C C H H H H H H H
charge: 1
multiplicity: 1
keywords: DSD-PBEP86 def2-TZVP D3BJ RIJCOSX verytightscf def2-TZVP/C def2/J soscf noTRAH
formula: C8H13
InChI: InChI=1/C8H13/c1-2-4-6-8-7-5-3-1/h1-2,7H,3-6,8H2
21 atoms
C  -1.993731 0.542917 0.116685
H  -2.169328 0.730384 1.17987
C  -1.916595 -0.98534 -0.174085
H  -2.671379 -1.563779 0.36289
C  -0.4939 -1.200301 0.300882
C  0.621676 -1.163929 -0.487783
C  1.913745 -0.666894 0.069986
H  2.030603 -0.950456 1.12135
H  2.777913 -1.041283 -0.486484
C  1.868352 0.893629 -0.055685
H  1.960081 1.172481 -1.112266
H  2.72004 1.338571 0.46612
C  0.539552 1.477009 0.501445
C  -0.588693 0.938691 -0.286293
H  0.533556 -1.30894 -1.564343
H  -2.011356 -1.184745 -1.24602
H  0.412613 1.303903 1.574436
H  -0.453185 1.020859 -1.367982
H  -2.754035 1.066339 -0.473836
H  0.570449 2.570174 0.344334
H  -0.349433 -1.159668 1.38213
totalener: -311.14593141 hartree
nucrepener: 383.52363496 hartree
electener: -694.66956638 hartree
oneelecener: -1167.37358689 hartree
twoeener: 472.70402051 hartree
kineticenergy: 310.01806685 hartree
exchangeener: -13.671557965560 hartree
correlationener: -0.924810041650 hartree
xcener: -14.596368007210 hartree
chargesum: 1.0000000
charge: -0.205950 0.166582 -0.202342 0.177460 -0.100618 -0.105828 -0.222416 0.156818 0.172384 -0.234588 0.150172 0.173777 -0.198873 0.027008 0.190065 0.160966 0.156629 0.195926 0.178726 0.190813 0.173287
charge: -0.196746 0.154760 -0.192517 0.149855 -0.069416 -0.068495 -0.212522 0.152623 0.155638 -0.204771 0.145877 0.150402 -0.222234 0.116017 0.160461 0.152421 0.154215 0.172063 0.156056 0.182147 0.164166
qa: -0.2060 0.1666 -0.2023 0.1775 -0.1006 -0.1058 -0.2224 0.1568 0.1724 -0.2346 0.1502 0.1738 -0.1989 0.0270 0.1901 0.1610 0.1566 0.1959 0.1787 0.1908 0.1733
va: 3.8581 0.9719 3.8568 0.9713 3.8522 3.8450 3.9015 0.9703 0.9696 3.8650 0.9718 0.9650 3.9085 3.6352 0.9542 0.9743 0.9723 0.9476 0.9698 0.9621 0.9621
total: -311.819041925 hartree
dispcorr: -0.011958181 hartree
energy: -311.831000106652
dipole: 0.55903 -0.88880 -0.32977 1.86640 -1.38562 0.48078 0.16869 -0.34016 -0.17147
magnitude: 0.60770 au
magnitude: 1.54465 debye
