program: Gaussian 09
title: 000051172
version: EM64L-G09RevD.01
frameworkgroup: C1[X(C16H17NO2)]
method: RPBEPBE
basis: SDD
operation: Freq
keyword: #p
keyword: freq=noraman
keyword: PBEPBE/SDD
title: #p freq=noraman PBEPBE/SDD
converged: YES YES NO NO
title: Mulliken charges:
elementType: O O N C C C C C C C C C C C C C C C C H H H H H H H H H H H H H H H H H
charge: -0.389840 -0.244020 -0.235168 0.351046 0.205593 0.335032 0.323088 -0.597519 0.259942 -0.394147 -0.349379 -0.387033 -0.800916 -0.380307 -0.828534 -0.251507 -0.238733 0.179493 -0.747242 0.256821 0.241393 0.252290 0.247190 0.251945 0.237518 0.220653 0.229686 0.251976 0.227724 0.228485 0.227569 0.227581 0.254332 0.226416 0.247933 0.360636
chargesum: 0.00000
title: Mulliken charges with hydrogens summed into heavy atoms:
elementType: O O N C C C C C C C C C C C C C C C C
charge: -0.029204 -0.244020 -0.235168 0.351046 0.205593 0.335032 0.323088 -0.340697 0.259942 -0.152754 -0.097089 -0.139844 -0.090799 -0.150621 -0.120347 -0.023938 -0.011152 0.179493 -0.018561
polarizability: 2.98293867e+02 1.02323427e+00 1.81939362e+02 -1.15074637e+00 9.51072760e-01 1.13908084e+02
1716.lowfreq: -9.0664 -3.0370 -0.0007 -0.0002 0.0005 3.7949 14.6717 36.5409 46.7391
frequency: 14.6355 36.5378 46.7304 61.0838 77.0725 86.3867 115.5007 116.3602 157.8164 167.7592 183.0860 186.5671 208.7896 253.0959 271.2625 292.4684 311.4771 330.3272 361.3737 399.6036 423.1903 438.7288 451.6488 468.6851 524.4030 541.9344 547.8966 552.1971 570.1572 582.6522 617.6081 648.6354 702.7276 728.5940 738.1432 766.7890 782.2454 832.1165 854.0224 872.2498 897.2994 910.7607 949.2059 955.9445 983.2258 986.0272 987.1314 994.4922 999.2128 1030.3505 1037.6340 1042.9853 1048.4559 1057.5077 1119.1520 1126.1230 1174.8621 1185.8167 1206.8945 1215.1024 1264.7027 1276.9403 1289.1615 1305.8534 1349.4001 1360.1773 1369.7028 1380.0426 1399.2568 1401.6881 1404.7579 1429.5128 1446.0577 1456.0288 1456.6380 1470.1641 1474.3100 1475.0963 1480.7310 1501.5358 1568.2587 1581.6149 1601.3259 1609.6773 1614.8768 2978.0364 2988.3551 3002.4676 3057.3848 3068.8590 3090.4398 3092.7910 3095.3130 3116.9737 3124.6457 3128.0199 3135.2944 3140.5963 3146.4003 3160.6787 3168.5584 3443.2058
redmass: 4.5353 4.9055 3.0440 2.5794 1.6609 3.0727 1.3771 2.3985 4.0094 1.0468 3.8625 3.6670 4.1622 4.2802 3.4640 4.3220 1.4131 2.2418 3.4880 4.7740 3.7230 3.6167 2.9566 3.0933 4.9300 4.0041 4.0807 4.9574 3.8858 5.7841 3.4505 5.7895 5.7872 3.4860 2.2514 1.5617 4.6924 1.4845 3.9012 1.3584 1.4178 4.4138 1.3818 1.4019 3.8520 1.5461 1.3552 2.0474 1.8029 1.6671 2.4726 1.5480 1.5563 2.1307 1.6779 1.8820 1.0641 1.9102 2.3017 2.3256 1.6088 1.4377 1.4814 2.2556 4.7072 4.2699 6.0819 1.2553 2.5257 1.2406 1.3886 2.1326 1.0929 1.0583 1.0641 1.1587 1.4325 1.2523 1.4614 2.5790 6.9460 6.6296 7.7702 6.1858 6.6501 1.0397 1.0369 1.0369 1.0942 1.0962 1.0967 1.0994 1.1004 1.0862 1.0893 1.0901 1.1011 1.0939 1.0877 1.1009 1.0972 1.0686
irintensity: 1.4732 2.2558 0.2849 2.1651 0.6536 2.7145 0.1590 4.6212 2.2930 0.9131 4.8241 2.1823 3.6355 7.5471 5.0168 8.8191 60.1378 81.0364 4.9322 8.7857 7.6789 7.9240 3.9663 4.7919 1.8162 6.8548 5.4656 11.3792 10.7406 3.9715 4.3974 9.3651 1.0558 2.2117 16.0771 74.5696 1.6372 22.7519 4.7845 1.3480 11.7339 37.5757 0.4543 0.5225 20.3819 2.7228 0.2313 15.1415 4.8596 7.9757 3.0387 7.8852 11.8091 3.6380 9.2209 2.7165 0.9788 2.7736 18.0999 30.8762 7.3700 0.8179 44.2478 4.6801 74.5895 106.0692 68.3116 66.5291 8.3049 20.4472 7.4192 3.2729 23.0081 12.4003 15.3936 16.9923 12.4079 18.1267 75.5129 15.0551 5.8024 2.1836 122.2127 8.2815 24.8545 24.0110 21.6772 7.3509 22.6107 13.1755 12.4672 16.6587 15.3572 10.5832 12.0627 3.8583 10.2731 33.3462 7.3392 35.6841 7.7807 4.3023
temp: 298.150 k
press: 1.00000 atm
elementType: 8 8 7 6 6 6 6 6 6 6 6 6 6 6 6 6 6 6 6 1 1 1 1 1 1 1 1 1 1 1 1 1 1 1 1 1
symmnumber: 1
zpe: 754462.5 jmol-1
zpe.correction: 0.287360 hartree
zpe.thermalcorrener: 0.306338 hartree
zpe.thermalcorrenthalpy: 0.307282 hartree
zpe.thermalcorrgfe: 0.238554 hartree
zpe.sumelectzpe: -823.702386 hartree
zpe.sumelectthermal: -823.683408 hartree
zpe.sumelectthermalent: -823.682464 hartree
zpe.sumelectthermalfe: -823.751191 hartree
dipole: -0.2436 -2.1685 -2.4838
dipole: 3.3062
quadrupole: -98.6976 -110.6060 -110.1193
quadrupole: -8.8403 -10.1563 -2.9812
quadrupole: 7.7767 -4.1317 -3.6450 -8.8403 -10.1563 -2.9812
hfenergy: -823.9897456 hartree
pointgroup: C01 [X(C16H17N1O2)]
dipole: -0.1000614 -0.4680568 -1.2094991 debye
polarizability: 298.2623555|-2.3412942|173.5224297|1.2141064|22.441792|122.356528 unknown
InChI: InChI=1S/C16H17NO2/c1-11-6-4-5-7-15(11)14-8-9-16(12(2)10-14)17(19)13(3)18/h4-10,19H,1-3H3
charge 0 multiplicity 1
36 atoms
O  3.934847 -1.162393 -1.12944
O  3.756108 1.377672 1.436415
N  3.337496 -0.144141 -0.256936
C  -0.940381 -0.058451 -0.08767
C  -2.436683 -0.061051 -0.07152
C  1.186689 -1.32484 0.176215
C  1.900428 -0.144965 -0.184584
C  -0.225689 -1.253468 0.199374
C  -3.210126 0.930839 0.613409
C  -0.192823 1.102896 -0.420159
C  1.211908 1.05528 -0.478045
C  -3.111955 -1.108992 -0.758942
C  1.907287 -2.603477 0.552788
C  -4.625656 0.836582 0.565243
C  -2.582746 2.056683 1.422734
C  -4.518811 -1.18276 -0.79876
C  -5.28349 -0.197744 -0.134312
C  4.213973 0.579693 0.568724
C  5.698011 0.340817 0.33175
H  -0.789909 -2.147384 0.49096
H  -0.711986 2.034356 -0.665578
H  1.787958 1.949318 -0.735842
H  -2.514721 -1.858881 -1.290619
H  2.399722 -3.062273 -0.322665
H  2.708314 -2.402691 1.287962
H  1.207975 -3.335349 0.990235
H  -5.219681 1.588116 1.099924
H  -1.618486 1.760356 1.868546
H  -2.391034 2.951942 0.800235
H  -3.259331 2.368996 2.237511
H  -5.01159 -1.994651 -1.344889
H  -6.378355 -0.238843 -0.152783
H  5.959429 -0.72016 0.484031
H  5.988989 0.600108 -0.70178
H  6.258573 0.970319 1.03859
H  3.816647 -0.80306 -2.053826
